Benadryl

Van Den Dool and Kratz RI, non-polar column, temperature ramp

Data compiled by: NIST Mass Spectrometry Data Center, William E. Wallace, director

Column type CapillaryCapillaryCapillaryCapillaryCapillary
Active phase SPB-1CBP-1DB-1DB-1SE-30
Column length (m) 30.12.15.15.15.
Carrier gas HeN2HeHeHe
Substrate
Column diameter (mm) 0.750.530.320.250.25
Phase thickness (μm) 1.0 0.250.250.25
Tstart (C) 160.120.120.120.100.
Tend (C) 280.250.280.280.295.
Heat rate (K/min) 10.6.8.8.5.
Initial hold (min)
Final hold (min) 12. 5.5.
I 1873.1846.1849.1849.1842.
ReferenceChrist, Noomano, et al., 1988Oyama, Sano, et al., 1987Perrigo, Peel, et al., 1985Perrigo, Ballantyne, et al., 1984Anderson and Stafford, 1983
Comment MSDC-RI MSDC-RI MSDC-RI MSDC-RI MSDC-RI
Column type CapillaryPacked
Active phase SE-30SE-30
Column length (m) 15.1.8
Carrier gas HeN2
Substrate  Chromosorb W
Column diameter (mm) 0.25
Phase thickness (μm) 0.25
Tstart (C) 100.130.
Tend (C) 295.290.
Heat rate (K/min) 5.8.
Initial hold (min)  2.
Final hold (min)  8.
I 1841.1865.
ReferenceAnderson and Stafford, 1983Perrigo and Peel, 1981
Comment MSDC-RI MSDC-RI

Normal alkane RI, non-polar column, temperature ramp

Data compiled by: NIST Mass Spectrometry Data Center, William E. Wallace, director

Column type PackedCapillaryCapillaryPacked
Active phase SE-30DB-5OV-1SE-30
Column length (m) 2.15. 2.
Carrier gas NitrogenHe
Substrate Chromosorb G AW DMCS (80-100 mesh)  Gas Chrom P
Column diameter (mm)  0.25
Phase thickness (μm)  0.2
Tstart (C) 100.185.200.120.
Tend (C) 300.270.280.200.
Heat rate (K/min)  10.16.2.5
Initial hold (min)
Final hold (min)
I 1873.1844.1873.1865.
ReferenceMHA, 9999Phillips, Logan, et al., 1990Schutz and Wollrab A., 1988Marozzi, Gambaro, et al., 1982
Comment MSDC-RI MSDC-RI MSDC-RI MSDC-RI

References

Christ, Noomano, et al., 1988
Christ, D.W.; Noomano, P.; Rosas, M.; Rhone, D., Retention indices by wide-bore capillary gas chromatography with nitrogen-phosphorus detection, J. Anal. Toxicol., 1988, 12, 2, 84-88, https://doi.org/10.1093/jat/12.2.84 . [all data]

Oyama, Sano, et al., 1987
Oyama, N.; Sano, T.; Syoyama, M.; Maeda, K., Studies on systematic analysis of poisonous compounds in forensic chemistry. II. Application of capillary column gas chromatography to substance identification by means of retention indices, Eisei Kagaku, 1987, 33, 5, 342-348, https://doi.org/10.1248/jhs1956.33.342 . [all data]

Perrigo, Peel, et al., 1985
Perrigo, B.J.; Peel, H.W.; Ballantyne, D.J., Use of Dual-Column Fused-Silica Capillary Gas Chromatography in Combination with Detector Response Factors for Analytical Toxicology., J. Chromatogr., 1985, 341, 81-88, https://doi.org/10.1016/S0378-4347(00)84011-6 . [all data]

Perrigo, Ballantyne, et al., 1984
Perrigo, B.J.; Ballantyne, D.J.; Peel, H.W., Condierations in developing a data base for drugs on a DBI capillary column, J. Can. Soc. Forensic Sci., 1984, 17, 2, 41-49, https://doi.org/10.1080/00085030.1984.10757360 . [all data]

Anderson and Stafford, 1983
Anderson, W.H.; Stafford, D.T., Applications of capillary gas chromatography in routine toxicological analyses, J. Hi. Res. Chromatogr. Chromatogr. Comm., 1983, 6, 5, 247-254, https://doi.org/10.1002/jhrc.1240060506 . [all data]

Perrigo and Peel, 1981
Perrigo, B.J.; Peel, H.W., The use of retention indices and temperature-programmed gas chromatography in analytical toxicology, J. Chromatogr. Sci., 1981, 19, 5, 219-226, https://doi.org/10.1093/chromsci/19.5.219 . [all data]