1,1,1,2,3,3-hexafluoro-4-methoxybutane

Phase change data

Data compiled by: William E. Acree, Jr., James S. Chickos

Enthalpy of vaporization

ΔvapH (kJ/mol) Temperature (K) Method Reference Comment
37.0308.IMurata, Yamashita, et al., 2002Based on data from 293. - 360. K.

References

Murata, Yamashita, et al., 2002
Murata, Junji; Yamashita, Shiro; Akiyama, Minoru; Katayama, Shinichiro; Hiaki, Toshihiko; Sekiya, Akira, Vapor Pressures of Hydrofluoroethers, J. Chem. Eng. Data, 2002, 47, 4, 911-915, https://doi.org/10.1021/je010322y . [all data]