Dibenzo[b,ghi]perylene

Gas phase ion energetics data

Data compiled by: Sharon G. Lias, Rhoda D. Levin, and Sherif A. Kafafi

Ionization energy determinations

IE (eV) Method Reference Comment
6.99PEClar and Schmidt, 1977Vertical value

References

Clar and Schmidt, 1977
Clar, E.; Schmidt, W., Correlations between photoelectron and ultraviolet absorption spectra of polycyclic hydrocarbons. The perylene, coronene and bisanthene series, Tetrahedron, 1977, 33, 2093. [all data]