13,17,21-Trimethylpentatriacontane

Normal alkane RI, non-polar column, custom temperature program

Data compiled by: NIST Mass Spectrometry Data Center, William E. Wallace, director

Column type CapillaryCapillaryCapillary
Active phase Polydimethyl siloxaneDexsil 300Dexsil 300
Column length (m)  15.15.
Carrier gas
Substrate
Column diameter (mm)
Phase thickness (μm)
Program not specified50 0C 5 0C/min -> 200 0C 2 0C/min -> 340 0C50 0C 5 0C/min -> 200 0C 2 0C/min -> 340 0C
I 3577.3580.3580.
ReferenceJunkes, Castanho, et al., 2003Lockey, 1981Lockey, 1981
Comment MSDC-RI MSDC-RI MSDC-RI

References

Junkes, Castanho, et al., 2003
Junkes, B.S.; Castanho, R.D.M.; Amboni, C.; Yunes, R.A.; Heinzen, V.E.F., Semiempirical Topological Index: A Novel Molecular Descriptor for Quantitative Structure-Retention Relationship Studies, Internet Electronic Journal of Molecular Design, 2003, 2, 1, 33-49. [all data]

Lockey, 1981
Lockey, K.H., Cuticular hydrocarbons of adult Cylindrinotus laevioctostriatus (Goeze) and Phylan gibbus (Fabricius) (Coleoptera: Tenebrionidae), Insect. Biochem., 1981, 11, 5, 549-561, https://doi.org/10.1016/0020-1790(81)90023-8 . [all data]