Cyclohexene, 4-methyl-1-(1-methylethenyl)-

Normal alkane RI, non-polar column, temperature ramp

Data compiled by: NIST Mass Spectrometry Data Center, William E. Wallace, director

Column type CapillaryCapillary
Active phase HP-55 % Phenyl methyl siloxane
Column length (m) 30.30.
Carrier gas HeliumHe
Substrate
Column diameter (mm) 0.250.25
Phase thickness (μm) 0.250.25
Tstart (C) 50.75.
Tend (C) 240.200.
Heat rate (K/min) 3.3.
Initial hold (min) 5.4.
Final hold (min)  8.
I 1071.1073.
ReferenceMonsef-Esfahani, Miri, et al., 2010Cicció and Gómez-Laurito, 2002
Comment MSDC-RI MSDC-RI

Van Den Dool and Kratz RI, non-polar column, custom temperature program

Data compiled by: NIST Mass Spectrometry Data Center, William E. Wallace, director

Column type CapillaryCapillary
Active phase HP-5MSBPX-5
Column length (m) 30.50.
Carrier gas HeHe
Substrate
Column diameter (mm) 0.250.32
Phase thickness (μm) 0.250.5
Program 60C (1 min) => 5 C/min => 210C => 10 C/min => 280C (15 min)0C (5min) => 40C/min => 40C (2min) => 10C/min => 280C
I 1073.51089.
ReferenceAndriamaharavo, 2014Elmore, Erbahadir, et al., 1997
Comment MSDC-RI MSDC-RI

References

Monsef-Esfahani, Miri, et al., 2010
Monsef-Esfahani, H.R.; Miri, A.; Amini, M.; Amanzadeh, Y.; Hadjiakhoondi, A.; Hajiaghaee, R.; Ajani, Y., Seasonal variations in the chemical composition, antioxidant activity and total phenolic content of Teucrium persicum Boiss. essential oils, Res. J. Biol. Sci., 2010, 5, 7, 492-498, https://doi.org/10.3923/rjbsci.2010.492.498 . [all data]

Cicció and Gómez-Laurito, 2002
Cicció, J.F.; Gómez-Laurito, J., Volatile constituents of the leaves of Siparuna thecaphora (Siparunaceae) from Turrialba, Costa Rica, Rev. Biol. Trop., 2002, 50, 3/4, 963-967. [all data]