1H-1,2,4-Triazol-3-amine, 1-propyl-

Gas phase ion energetics data

Data compiled by: Sharon G. Lias, Rhoda D. Levin, and Sherif A. Kafafi

Appearance energy determinations

Ion AE (eV) Other Products MethodReferenceComment
C2H4N4+10.2C3H6EIMaquestiau, Van Haverbeke, et al., 1975
C5H10N4+8.1?EIMaquestiau, Van Haverbeke, et al., 1975

References

Maquestiau, Van Haverbeke, et al., 1975
Maquestiau, A.; Van Haverbeke, Y.; Flammang, R.; Cooks, R.G., Fragmentation d'azoles sous l'impact electronique, Org. Mass Spectrom., 1975, 10, 946. [all data]