1,3-Benzodithiole-2-ethyl-2-methyl-

Gas phase ion energetics data

Data compiled by: Sharon G. Lias, Rhoda D. Levin, and Sherif A. Kafafi

Ionization energy determinations

IE (eV) Method Reference Comment
7.85PEGuimon, Pfister-Guillouzo, et al., 1976Vertical value

References

Guimon, Pfister-Guillouzo, et al., 1976
Guimon, C.; Pfister-Guillouzo, G.; Arbelot, M., Spectres photoelectroniques de la dithiole-1,3-thione-2 et de son derive benzosubtitue, J. Mol. Struct., 1976, 30, 339. [all data]