N-Phenylperfluorobenzamide

Reaction thermochemistry data

Data compiled by: John E. Bartmess

Individual Reactions

C13H5F5NO- + Hydrogen cation = N-Phenylperfluorobenzamide

By formula: C13H5F5NO- + H+ = C13H6F5NO

Quantity Value Units Method Reference Comment
Δr1302. ± 8.4kJ/molIMREKoppel, Koppel, et al., 1998gas phase

Gas phase ion energetics data

Data compiled by: John E. Bartmess

De-protonation reactions

C13H5F5NO- + Hydrogen cation = N-Phenylperfluorobenzamide

By formula: C13H5F5NO- + H+ = C13H6F5NO

Quantity Value Units Method Reference Comment
Δr1302. ± 8.4kJ/molIMREKoppel, Koppel, et al., 1998gas phase

References

Koppel, Koppel, et al., 1998
Koppel, I.; Koppel, J.; Maria, P.C.; Gal, J.F.; Notario, R.; Vlasov, V.M.; Taft, R.W., Comparison of Bronsted acidities of neutral NH-acids in gas phase, dimethyl sulfoxide and water, Int. J. Mass Spectrom., 1998, 175, 1-2, 61-69, https://doi.org/10.1016/S0168-1176(98)00113-X . [all data]