2-mercaptoethyl acetate

Normal alkane RI, non-polar column, custom temperature program

View large format table.

Column type Active phase I Reference Comment
CapillaryCP Sil 5 CB887.Vermeulen, Lejeune, et al., 200650. m/0.32 mm/1.2 μm; Program: 40C(4min) => 2C/min => 132C => 10C/min => 250C (15min)

Normal alkane RI, polar column, custom temperature program

View large format table.

Column type Active phase I Reference Comment
CapillaryFFAP1444.Vermeulen, Lejeune, et al., 200625. m/0.32 mm/0.3 μm; Program: 40C(4min) => 2C/min => 132C => 10C/min => 250C (15min)

References

Vermeulen, Lejeune, et al., 2006
Vermeulen, C.; Lejeune, I.; Tran, T.T.H.; Collin, S., Occurrence of polyfunctional thiols in fresh lager beers, J. Agric. Food Chem., 2006, 54, 14, 5061-5068, https://doi.org/10.1021/jf060669a . [all data]