phenol, 2-methoxy-5-propyl-
- Formula: C10H14O2
- Molecular weight: 166.2170
- IUPAC Standard InChIKey: TZUORCZPIKYDQG-UHFFFAOYSA-N
- CAS Registry Number: 58539-27-8
- Chemical structure:

Phase change data

Data compiled by: Thermodynamics Research Center, NIST Boulder Laboratories, Chris Muzny director
Quantity | Value | Units | Method | Reference | Comment |
---|---|---|---|---|---|
Tfus | 294.65 | K | N/A | Coulthard, Marshall, et al., 1930 | Uncertainty assigned by TRC = 2. K |

References

Coulthard, Marshall, et al., 1930
Coulthard, C.E.; Marshall, J.; Pyman, F.L.,
The Variation of Phenol Coefficients in a Homologous Series of Phenols,
J. Chem. Soc., 1930, 1930, 280. [all data]