2,3-Octanedione

Normal alkane RI, non-polar column, custom temperature program

Data compiled by: NIST Mass Spectrometry Data Center, William E. Wallace, director

Column type CapillaryCapillaryCapillaryCapillaryCapillary
Active phase DB-5SqualaneDB-5 MSDB-5 MSHP-5
Column length (m) 60. 30.60.50.
Carrier gas Helium HeliumHelium
Substrate
Column diameter (mm) 0.25 0.320.320.32
Phase thickness (μm) 1.00 1.01.01.05
Program 40 0C 4 0C/min -> 230 0C 100 0C/min -> 260 0C (11.7 min)not specified-10 0C (3 min) 50 0C/min -> 40 0C 5 0C/min -> 290 0C (5 min)40 0C (2 min) 6 0C/min -> 100 0C 4 0C/min -> 180 0C 8 0C/min -> 250 0C (12 min)40C(10min) => 5C/min => 200C => 20C/min => 250C(5min)
I 991.968.986.984.984.
ReferenceMiyazaki, Plotto, et al., 2011Chen, 2008Watanabe, Ueda, et al., 2008Liu, Xu, et al., 2007Garcia-Estaban, Ansorena, et al., 2004
Comment MSDC-RI MSDC-RI MSDC-RI MSDC-RI MSDC-RI
Column type CapillaryCapillaryCapillary
Active phase DB-5MDN-5SF96+Igepal
Column length (m) 50.30.152.
Carrier gas  Helium
Substrate
Column diameter (mm) 0.320.250.76
Phase thickness (μm) 1.050.25
Program 40C(10min) => 5C/min => 200C => 20C/min => 250C (5min)35 0C (1 min) 120 0C/min -> 60 0C 2 0C/min -> 280 0C25C(1min) => 5C/min => 50C (4min) => 1.25C/min => 180C
I 984.981.971.
ReferenceGarcia-Estaban, Ansorena, et al., 2004, 2Turchimi, Mentasti, et al., 2004Flath, Altieri, et al., 1984
Comment MSDC-RI MSDC-RI MSDC-RI

Normal alkane RI, polar column, temperature ramp

Data compiled by: NIST Mass Spectrometry Data Center, William E. Wallace, director

Column type CapillaryCapillaryCapillaryCapillary
Active phase DB-WaxBP-20ZB-WaxSupelcowax-10
Column length (m) 60.30.60.60.
Carrier gas  HeHeHe
Substrate
Column diameter (mm) 0.350.250.320.25
Phase thickness (μm)  0.250.50.25
Tstart (C) 40.70.40.35.
Tend (C) 200.220.250.200.
Heat rate (K/min) 4.4.3.4.
Initial hold (min)  4.2.10.
Final hold (min)  5.10.
I 1325.1336.1342.1360.
ReferenceGaneko, Shoda, et al., 2008Rawat, Gulati, et al., 2007Wierda R.L., Fletcher G., et al., 2006Girard and Durance, 2000
Comment MSDC-RI MSDC-RI MSDC-RI MSDC-RI

References

Miyazaki, Plotto, et al., 2011
Miyazaki, T.; Plotto, A.; Goodner, K.; Gmitter F.G., Distribution of aroma volatile compounds in tangerine hybrids and proposed inheritance, J. Sci. Food Agric., 2011, 91, 3, 449-460, https://doi.org/10.1002/jsfa.4205 . [all data]

Chen, 2008
Chen, H.-F., Quantitative prediction of gas chromatography retention indices with support vector machines, radial basis neutral networks and multiple linear regression, Anal. Chim. Acta, 2008, 609, 1, 24-36, https://doi.org/10.1016/j.aca.2008.01.003 . [all data]

Watanabe, Ueda, et al., 2008
Watanabe, A.; Ueda, Y.; Higuchi, M.; Shiba, N., Analysis of volatile compounds in beef fat by dinamic-headspace solid phase microextraction combined with gas chromatography - mass spectrometry, J. Food Sci., 2008, 73, 5, 420-425, https://doi.org/10.1111/j.1750-3841.2008.00764.x . [all data]

Liu, Xu, et al., 2007
Liu, Y.; Xu, X.-L.; Zhou, G.-H., Comparative study of volatile compounds in traditional Chinese Nanjing marinated duck by different extraction techniques, Int. J. Food Sci. Technol., 2007, 42, 5, 543-550, https://doi.org/10.1111/j.1365-2621.2006.01264.x . [all data]

Garcia-Estaban, Ansorena, et al., 2004
Garcia-Estaban, M.; Ansorena, D.; Astiasaran, I.; Martin, D.; Ruiz, J., Comparison of simultaneous distillation extraction (SDE) and solid-phase microextraction (SPME) for the analysis of volatile compounds in dry-cured ham, J. Sci. Food Agric., 2004, 84, 11, 1364-1370, https://doi.org/10.1002/jsfa.1826 . [all data]

Garcia-Estaban, Ansorena, et al., 2004, 2
Garcia-Estaban, M.; Ansorena, D.; Astiasarán, I.; Ruiz, J., Study of the effect of different fiber coatings and extraction conditions on dry cured ham volatile compounds extracted by solid-phase microextraction (SPME), Talanta, 2004, 64, 2, 458-466, https://doi.org/10.1016/j.talanta.2004.03.007 . [all data]

Turchimi, Mentasti, et al., 2004
Turchimi, G.N.; Mentasti, T.; Carpino, F.; Panseri, S.; Moretti, V.M.; Valfre, F., Effects of dietary lipid sources on flavour volatile compounds of brown trout (Salmo trurra L.) fillet, J. Appl. Ichtyol., 2004, 20, 1, 71-75, https://doi.org/10.1046/j.0175-8659.2003.00522.x . [all data]

Flath, Altieri, et al., 1984
Flath, R.A.; Altieri, M.A.; Mon, T.R., Volatile constituents of Amaranthus retroflexus L., J. Agric. Food Chem., 1984, 32, 1, 92-94, https://doi.org/10.1021/jf00121a024 . [all data]