Antimony monoselenide

Constants of diatomic molecules

Data compiled by: Klaus P. Huber and Gerhard H. Herzberg

Data collected through July, 1977

Symbols used in the table of constants
SymbolMeaning
State electronic state and / or symmetry symbol
Te minimum electronic energy (cm-1)
ωe vibrational constant – first term (cm-1)
ωexe vibrational constant – second term (cm-1)
ωeye vibrational constant – third term (cm-1)
Be rotational constant in equilibrium position (cm-1)
αe rotational constant – first term (cm-1)
γe rotation-vibration interaction constant (cm-1)
De centrifugal distortion constant (cm-1)
βe rotational constant – first term, centrifugal force (cm-1)
re internuclear distance (Å)
Trans. observed transition(s) corresponding to electronic state
ν00 position of 0-0 band (units noted in table)
Diatomic constants for (121)Sb(80)Se
StateTeωeωexeωeyeBeαeγeDeβereTrans.ν00
D 43756 365.74 H 0.76        D ← X V 43776 H
Sharma, 1953
C (41600) 1          C ← X V
Sharma, 1953
B 36041 418.0 H 0.48        B ← X V 36087 H
Sharma, 1953
A 28965 221.8 H 1.0        A ← X R 28913 H
Sharma, 1953
StateTeωeωexeωeyeBeαeγeDeβereTrans.ν00
X 0 326.1 H 1.04

References

Sharma, 1953
Sharma, C.B., Absorption bands of SbSe and SbTe in the quartz ultra-violet region 3650 to 2200 Å, Proc. Phys. Soc. London Sect. A, 1953, 66, 1109. [all data]

Porter and Spencer, 1960
Porter, R.F.; Spencer, C.W., Stabilities of the gaseous molecules, BiSe, BiTe, and SbTe, J. Chem. Phys., 1960, 32, 943. [all data]