2-Oxazolidinethione

Gas phase ion energetics data

Data compiled by: Sharon G. Lias, Rhoda D. Levin, and Sherif A. Kafafi

Ionization energy determinations

IE (eV) Method Reference Comment
8.37PEAndreocci, Devillanova, et al., 1980
8.37 ± 0.03PEGuimon, Pfister-Guillouzo, et al., 1974Vertical value

Phase change data

Data compiled by: William E. Acree, Jr., James S. Chickos

Quantity Value Units Method Reference Comment
Δsub25.1 ± 1.1kcal/molMERoux, Temprado, et al., 2009Based on data from 325. - 354. K.

Enthalpy of sublimation

ΔsubH (kcal/mol) Temperature (K) Method Reference Comment
24.9 ± 1.1340.MERoux, Temprado, et al., 2009Based on data from 325. - 354. K.

Enthalpy of fusion

ΔfusH (kcal/mol) Temperature (K) Method Reference
3.80370.DSCTemprado, Roux, et al., 2008

References

Andreocci, Devillanova, et al., 1980
Andreocci, M.V.; Devillanova, F.A.; Furlani, C.; Mattogno, G.; Verani, G.; Zanoni, R., Structural characterization of some substituted azolidine molecules: UPS photoelectron spectroscopic studies, J. Mol. Struct., 1980, 69, 151. [all data]

Guimon, Pfister-Guillouzo, et al., 1974
Guimon, C.; Pfister-Guillouzo, G.; Arbelot, M.; Chanon, M., Electronic structure of sulphur compounds. VII. Photoelectron spectra of thiocarbonyl J. Heterocycl. Chem.., Tetrahedron, 1974, 30, 3831. [all data]