Prochlorperazine

Normal alkane RI, non-polar column, custom temperature program

Data compiled by: NIST Mass Spectrometry Data Center, William E. Wallace, director

Column type CapillaryPackedCapillaryOther
Active phase HP-1OV-101OV-1, SE-30, Methyl silicone, SP-2100, OV-101, DB-1, etc.Methyl Silicone
Column length (m)  2.50.
Carrier gas Helium Hydrogen
Substrate  Gas Chrom Q
Column diameter (mm)   0.32
Phase thickness (μm)
Program not specifiednot specifiednot specifiednot specified
I 2970.2997.2921.2954.
ReferenceGrigor'ev, Bozhko, et al., 2009Buydens, Massart, et al., 1985Waggott and Davies, 1984Ardrey and Moffat, 1981
Comment MSDC-RI MSDC-RI MSDC-RI MSDC-RI

References

Grigor'ev, Bozhko, et al., 2009
Grigor'ev, A.M.; Bozhko, E.S.; Rudakova, L.V., Use of correlation between retention indices on low-polarity phases for screening comp-lex mixtures by gas chromatography-mass spectrometry, Rus. J. Anal. Chem., 2009, 64, 2, 140-143, https://doi.org/10.1134/S1061934809020087 . [all data]

Buydens, Massart, et al., 1985
Buydens, L.; Massart, D.L.; Geerlings, P., Relationship Between Gas Chromatographic Behavior and Topological, Physicochemical, and Quantum Chemically Calculated Charge Parameters for Neuroleptica, J. Chromatogr. Sci., 1985, 23, 7, 304-307, https://doi.org/10.1093/chromsci/23.7.304 . [all data]

Waggott and Davies, 1984
Waggott, A.; Davies, I.W., Identification of organic pollutants using linear temperature programmed retention indices (LTPRIs) - Part II, 1984, retrieved from http://dwi.defra.gov.uk/research/completed-research/reports/dwi0383.pdf. [all data]

Ardrey and Moffat, 1981
Ardrey, R.E.; Moffat, A.C., Gas-liquid chromatographic retention indices of 1318 substances of toxicological interest on SE-30 or OV-1 stationary phase, J. Chromatogr., 1981, 220, 3, 195-252, https://doi.org/10.1016/S0021-9673(00)81925-1 . [all data]