1,2,4,3,5-Trithia(4-siv)diazole, 1-[[(trifluoromethyl)sulfonyl]imino]-1,1-dihydro-

Gas phase ion energetics data

Data compiled by: Sharon G. Lias, Rhoda D. Levin, and Sherif A. Kafafi

Ionization energy determinations

IE (eV) Method Reference Comment
9.5PEAndreocci, Bossa, et al., 1980
10.0PEAndreocci, Bossa, et al., 1980Vertical value

References

Andreocci, Bossa, et al., 1980
Andreocci, M.V.; Bossa, M.; diCastro, V.; Furlani, C.; Mattogno, G.; Roesky, H.W., Electronic structure of S3N2 ring derivatives: A photoelectron spectroscopy study, Gazz. Chim. Ital., 1980, 110, 1. [all data]