(1R,4R)-1-methyl-4-(6-Methylhept-5-en-2-yl)cyclohex-2-enol

Van Den Dool and Kratz RI, polar column, temperature ramp

Data compiled by: NIST Mass Spectrometry Data Center, William E. Wallace, director

Column type CapillaryCapillaryCapillary
Active phase DB-WaxCarbowax 20MCarbowax 20M
Column length (m) 25.60.60.
Carrier gas HeHeHe
Substrate
Column diameter (mm) 0.250.320.32
Phase thickness (μm) 0.25
Tstart (C) 50.50.50.
Tend (C) 240.225.225.
Heat rate (K/min) 4.1.51.5
Initial hold (min) 3.
Final hold (min)  80.80.
I 2104.2109.2109.
ReferenceMöllenbeck, König, et al., 1997Chen and Ho, 1988Chen and Ho, 1988
Comment MSDC-RI MSDC-RI MSDC-RI

Kovats' RI, non-polar column, custom temperature program

Data compiled by: NIST Mass Spectrometry Data Center, William E. Wallace, director

Column type Capillary
Active phase DB-5MS
Column length (m) 30.
Carrier gas He
Substrate
Column diameter (mm) 0.25
Phase thickness (μm) 0.25
Program 60C(5min) => 2C/min => 140C= 5C/min => 250C(5min)
I 1635.
ReferenceTuberoso, Kowalczyk, et al., 2005
Comment MSDC-RI

References

Möllenbeck, König, et al., 1997
Möllenbeck, S.; König, T.; Schreier, P.; Schwab, W.; Rajaonarivony, J.; Ranarivelo, L., Chemical composition and analyses of enantiomers of essential oils from Madagascar, Flavour Fragr. J., 1997, 12, 2, 63-69, https://doi.org/10.1002/(SICI)1099-1026(199703)12:2<63::AID-FFJ614>3.0.CO;2-Z . [all data]

Chen and Ho, 1988
Chen, C.-C.; Ho, C.-T., Gas chromatographic analysis of volatile components of ginger oil (Zingiber officinale Roscoe) extracted with liquid carbon dioxide, J. Agric. Food Chem., 1988, 36, 2, 322-328, https://doi.org/10.1021/jf00080a020 . [all data]