(1S,2R,5R)-2-Methyl-5-((R)-6-methylhept-5-en-2-yl)bicyclo[3.1.0]hexan-2-ol

Kovats' RI, non-polar column, temperature ramp

View large format table.

Column type Active phase I Reference Comment
CapillaryBP-11539.Srivastava, Srivastava, et al., 200630. m/0.32 mm/0.25 μm, N2, 5. K/min, 220. C @ 3. min; Tstart: 60. C
CapillaryHP-5MS1542.Juliani, Zygadlo, et al., 200430. m/0.25 mm/0.25 μm, He, 60. C @ 1. min, 4. K/min, 200. C @ 15. min
CapillaryDB-51530.Marongiu, Piras, et al., 200330. m/0.25 mm/0.25 μm, He, 3. K/min, 240. C @ 30. min; Tstart: 60. C
CapillaryDB-11540.Mevy, Bessiere, et al., 2002He, 3. K/min; Column length: 25. m; Column diameter: 0.2 mm; Tstart: 60. C; Tend: 220. C
CapillaryBP-11539.Raina, Srivastava, et al., 200225. m/0.55 mm/0.25 μm, N2, 5. K/min, 220. C @ 15. min; Tstart: 60. C
CapillaryHP-51543.Sajjadi and Ghassemi, 199930. m/0.25 mm/0.25 μm, He, 4. K/min; Tstart: 60. C; Tend: 280. C

Van Den Dool and Kratz RI, non-polar column, temperature ramp

View large format table.

Column type Active phase I Reference Comment
CapillaryDB-51545.Masoudi, Esmaeili, et al., 200650. m/0.2 mm/0.32 μm, N2, 60. C @ 3. min, 5. K/min, 220. C @ 5. min
CapillaryHP-5MS1590.Saroglou, Dorizas, et al., 200630. m/0.25 mm/0.25 μm, He, 60. C @ 5. min, 4. K/min; Tend: 280. C
CapillaryBP-11567.Gonny, Bradesi, et al., 200450. m/0.22 mm/0.25 μm, 2. K/min, 220. C @ 20. min; Tstart: 60. C
CapillaryHP-5MS1525.Tzakou, Vagias, et al., 200430. m/0.25 mm/0.25 μm, He, 3. K/min; Tstart: 60. C; Tend: 280. C
CapillaryRTX-11565.Cavalli, Tomi, et al., 200360. m/0.22 mm/0.25 μm, He, 2. K/min, 230. C @ 45. min; Tstart: 60. C
CapillaryRTX-51536.Mondello, Zappia, et al., 200230. m/0.25 mm/0.25 μm, He, 45. C @ 6. min, 3. K/min, 300. C @ 10. min
CapillaryCP Sil 5 CB1560.Weyerstahl, Marschall, et al., 1999He, 5. K/min; Column length: 25. m; Column diameter: 0.25 mm; Tstart: 60. C; Tend: 260. C

Van Den Dool and Kratz RI, polar column, temperature ramp

View large format table.

Column type Active phase I Reference Comment
CapillaryBP-202088.Gonny, Bradesi, et al., 200450. m/0.22 mm/0.25 μm, 2. K/min, 220. C @ 20. min; Tstart: 60. C
CapillaryRTX-Wax2075.Cavalli, Tomi, et al., 200360. m/0.22 mm/0.25 μm, He, 2. K/min, 230. C @ 45. min; Tstart: 60. C

Normal alkane RI, non-polar column, temperature ramp

View large format table.

Column type Active phase I Reference Comment
CapillaryPolydimethyl siloxane with 5 % Ph1540.Priya, Prathapan, et al., 2012Helium, 5. K/min, 200. C @ 25. min; Column length: 30. m; Tstart: 80. C
CapillaryHP-5MS1540.Ferhat, Tigrine-Kordjani, et al., 200730. m/0.25 mm/0.25 μm, He, 60. C @ 8. min, 2. K/min, 250. C @ 15. min
CapillaryCol-Elite 5MS1554.Gudaityte and Venskutonis R.P., 200730. m/0.25 mm/0.25 μm, He, 3. K/min; Tstart: 30. C; Tend: 246. C
CapillaryDB-51543.Sefidkon, Abbasi, et al., 200730. m/0.25 mm/0.25 μm, He, 4. K/min; Tstart: 50. C; Tend: 240. C
CapillaryDB-11521.Khalighi-Sigaroodi, Hadijiakhoondi, et al., 200530. m/0.25 mm/0.25 μm, He, 50. C @ 1. min, 2.5 K/min, 265. C @ 30. min
CapillaryDB-5MS1524.Marongiu, Piras, et al., 200530. m/0.25 mm/0.25 μm, He, 60. C @ 30. min, 3. K/min; Tend: 280. C
CapillaryHP-5MS1544.Petrakis, Roussis, et al., 20053. K/min; Column length: 30. m; Column diameter: 0.2 mm; Tstart: 60. C; Tend: 280. C
CapillarySPB-51562.Gauvin, Ravaomanarivo, et al., 200460. m/0.32 mm/1. μm, He, 4. K/min, 200. C @ 30. min; Tstart: 60. C
CapillaryDB-51542.Zoghbi, Andrade, et al., 200330. m/0.25 mm/0.25 μm, He, 3. K/min; Tstart: 60. C; Tend: 240. C

Normal alkane RI, non-polar column, custom temperature program

View large format table.

Column type Active phase I Reference Comment
CapillaryCP Sil 8 CB1544.Mockute, Bernotiene, et al., 200750. m/0.32 mm/0.25 μm, He; Program: 60 0C (2 min) 5 0C/min -> 160 0C 5 0C/min -> 250 0C (10 min)
CapillaryCP Sil 8 CB1545.Mockute, Nivinskiene, et al., 200350. m/0.32 mm/0.25 μm, He; Program: 60C(1min) => 5C/min => 160C => 10C/min => 250C(5min)
CapillaryCP Sil 5 CB1581.Weyerstahl, Marschall, et al., 1999, 2He; Column length: 25. m; Column diameter: 0.39 mm; Program: not specified
CapillaryCP Sil 5 CB1572.Weyerstahl, Marschall, et al., 1997N2; Column length: 25. m; Program: not specified

References

Srivastava, Srivastava, et al., 2006
Srivastava, A.K.; Srivastava, S.K.; Syamsundar, K.V., Volatile composition of Curcuma angustifolia Roxb. rhizome from central and southern India, Flavour Fragr. J., 2006, 21, 3, 423-426, https://doi.org/10.1002/ffj.1680 . [all data]

Juliani, Zygadlo, et al., 2004
Juliani, H.R.; Zygadlo, J.A.; Scrivanti, R.; de la Sota, E.; Simon, J.E., The essential oil of Anemia tomentosa (Savigny) Sw. var. anthriscifolia (Schrad.) Mickel, Flavour Fragr. J., 2004, 19, 6, 541-543, https://doi.org/10.1002/ffj.1341 . [all data]

Marongiu, Piras, et al., 2003
Marongiu, B.; Piras, A.; Pani, F.; Porcedda, S.; Ballero, M., Extraction, separation and isolation of essential oils from natural matrices by supercritical CO2, Flavour Fragr. J., 2003, 18, 6, 505-509, https://doi.org/10.1002/ffj.1258 . [all data]

Mevy, Bessiere, et al., 2002
Mevy, J.P.; Bessiere, J.-M.; Dherbomez, M.; Viano, J., Composition and some biological activities of the essential oils from an African pasture grass: Elionurus elegans Kunth., J. Agric. Food Chem., 2002, 50, 15, 4240-4243, https://doi.org/10.1021/jf0115140 . [all data]

Raina, Srivastava, et al., 2002
Raina, V.K.; Srivastava, S.K.; Jain, N.; Ahmad, A.; Syamasundar, K.V.; Aggarwal, K.K., Essential oil composition of Curcuma longa L. cv. Roma from the plains of northern India, Flavour Fragr. J., 2002, 17, 2, 99-102, https://doi.org/10.1002/ffj.1053 . [all data]

Sajjadi and Ghassemi, 1999
Sajjadi, S.E.; Ghassemi, N., Volatile constituents of Nepeta glomerulosa Boiss. subsp. carmanica, Flavour Fragr. J., 1999, 14, 5, 265-267, https://doi.org/10.1002/(SICI)1099-1026(199909/10)14:5<265::AID-FFJ822>3.0.CO;2-A . [all data]

Masoudi, Esmaeili, et al., 2006
Masoudi, S.; Esmaeili, A.; Khalilzadeh, M.A.; Rustaiyan, A.; Moazami, N.; Akhgar, M.R.; Varavipoor, M., Volatile constituents of Dorema aucheri Boiss., Seseli libanotis (L.) W. D. Koch var. armeniacum bordz. and Conium maculatum L. three Umbelliferae herbs growing wild in Iran, Flavour Fragr. J., 2006, 21, 5, 801-804, https://doi.org/10.1002/ffj.1722 . [all data]

Saroglou, Dorizas, et al., 2006
Saroglou, V.; Dorizas, N.; Kypriotakis, Z.; Skaltsa, H.D., Analysis of the essential oil composition of eight Anthemis species from Greece, J. Chromatogr. A, 2006, 1104, 1-2, 313-322, https://doi.org/10.1016/j.chroma.2005.11.087 . [all data]

Gonny, Bradesi, et al., 2004
Gonny, M.; Bradesi, P.; Casanova, J., Identification of the components of the essential oil from wild Corsican Daucus carota L. using 13C-NMR spectroscopy, Flavour Fragr. J., 2004, 19, 5, 424-433, https://doi.org/10.1002/ffj.1330 . [all data]

Tzakou, Vagias, et al., 2004
Tzakou, O.; Vagias, C.; Gani, A.; Yannitsaros, A., Volatile constituents of essential oils isolated at different growth stages from three Conyza species growing in Greece, Flavour Fragr. J., 2004, 19, 425-428. [all data]

Cavalli, Tomi, et al., 2003
Cavalli, J.-F.; Tomi, F.; Bernardini, A.-F.; Casanova, J., Composition and chemical variability of the bark oil of Cedrelopsis grevei H. Baillon from Madagascar, Flavour Fragr. J., 2003, 18, 6, 532-538, https://doi.org/10.1002/ffj.1263 . [all data]

Mondello, Zappia, et al., 2002
Mondello, L.; Zappia, G.; Cotroneo, A.; Bonaccorsi, I.; Chowdhury, J.U.; Yusuf, M.; Dugo, G., Studies on the essential oil-bearing plants of Bangladesh. Part VIII. Composition of some Ocimum oils O. basilicum L. var. purpurascens; O. sanctum L. green; O. sanctum L. purple; O. americanum L., citral type; O. americanum L., camphor type, Flavour Fragr. J., 2002, 17, 5, 335-340, https://doi.org/10.1002/ffj.1108 . [all data]

Weyerstahl, Marschall, et al., 1999
Weyerstahl, P.; Marschall, H.; Wahlburg, H.-C.; Christiansen, C.; Rustaiyan, A.; Mirdjalili, F., Constituents of the essential oil of Pulicaria gnaphalodes (Vent.) Boiss. from Iran, Flavour Fragr. J., 1999, 14, 2, 121-130, https://doi.org/10.1002/(SICI)1099-1026(199903/04)14:2<121::AID-FFJ790>3.0.CO;2-K . [all data]

Priya, Prathapan, et al., 2012
Priya, R.; Prathapan, A.; Raghu, K.G.; Menon, A.N., Chemical composition and in vitro antioxidative potential of essential oil isolated from Curcuma longa L. leaves, Asian Pacific Journal of Tropical Biomedicine, 2012, 2, 2, s695-s699, https://doi.org/10.1016/S2221-1691(12)60298-6 . [all data]

Ferhat, Tigrine-Kordjani, et al., 2007
Ferhat, M.A.; Tigrine-Kordjani, N.; Chemat, S.; Meklati, B.Y.; Chemat, F., Rapid Extraction of Volatile Compounds Using a New Simultaneous Microwave Distillation: Solvent Extraction Device, Chromatographia, 2007, 65, 3-4, 217-222, https://doi.org/10.1365/s10337-006-0130-5 . [all data]

Gudaityte and Venskutonis R.P., 2007
Gudaityte, O.; Venskutonis R.P., Chemotypes of Achillea millefolium transferred from 14 different locations in Lithuania to the controlled environment, Biochem. Syst. Ecol., 2007, 35, 9, 582-592, https://doi.org/10.1016/j.bse.2007.03.016 . [all data]

Sefidkon, Abbasi, et al., 2007
Sefidkon, F.; Abbasi, K.; Jamzad, Z.; Ahmadi, S., The effect of distillation methods and stage of plant growth on the essential oil content and composition of Satureja rechingeri Jamzad, Food Chem., 2007, 100, 3, 1054-1058, https://doi.org/10.1016/j.foodchem.2005.11.016 . [all data]

Khalighi-Sigaroodi, Hadijiakhoondi, et al., 2005
Khalighi-Sigaroodi, F.; Hadijiakhoondi, A.; Shahverdi, A.R.; Mozaffarian, V.-A.; Shafiee, A., Chemical composition and antimicrobial activity of the essential oil of Ferulago Bernardii Tomk. and M.Pimen., DARU, 2005, 13, 3, 100-104. [all data]

Marongiu, Piras, et al., 2005
Marongiu, B.; Piras, A.; Porcedda, S.; Scorciapino, A., Chemical composition of the essential oil and supercritical CO2 extract of Commiphora myrrha (Nees) Engl. and of Acorus calamus L., J. Agric. Food Chem., 2005, 53, 20, 7939-7943, https://doi.org/10.1021/jf051100x . [all data]

Petrakis, Roussis, et al., 2005
Petrakis, P.V.; Roussis, V.; Papadimitriou, D.; Vagias, C.; Tsitsimpikou, C., The effect of terpenoid extracts from 15 pine species on the feeding behavioural sequence of the late instars of the pine processionary caterpillar Thaumetopoea pityocampa, Behav. Processes, 2005, 69, 3, 303-322, https://doi.org/10.1016/j.beproc.2004.12.008 . [all data]

Gauvin, Ravaomanarivo, et al., 2004
Gauvin, A.; Ravaomanarivo, H.; Smadja, J., Comparative analysis by gas chromatography?mass spectrometry of the essential oils from bark and leaves of Cedrelopsis grevei Baill, an aromatic and medicinal plant from Madagascar, J. Chromatogr. A, 2004, 1029, 1-2, 279-282, https://doi.org/10.1016/j.chroma.2003.12.012 . [all data]

Zoghbi, Andrade, et al., 2003
Zoghbi, M.G.B.; Andrade, E.H.A.; da Silva, M.H.; Carreira, L.M.M.; Maia, J.G.S., Essential oils from three Myrcia species, Flavour Fragr. J., 2003, 18, 5, 421-424, https://doi.org/10.1002/ffj.1242 . [all data]

Mockute, Bernotiene, et al., 2007
Mockute, D.; Bernotiene, G.; Judzentiene, A., The essential oil of Ground Ivy (Glechoma hederaceae L.) growing wild in Eastern Lithuania, J. Essent. Oil Res., 2007, 19, 5, 449-451, https://doi.org/10.1080/10412905.2007.9699948 . [all data]

Mockute, Nivinskiene, et al., 2003
Mockute, D.; Nivinskiene, O.; Bernotiene, G.; Butkiene, R., The cis-thujone chemotype of Salvia officinalis L. essential oils, Chemija, 2003, 14, 4, 216-220. [all data]

Weyerstahl, Marschall, et al., 1999, 2
Weyerstahl, P.; Marschall, H.; Son, P.T.; Giang, P.M., Constituents of the flower essential oil of Aglaia odorata Lour. from Vietnam, Flavour Fragr. J., 1999, 14, 4, 219-224, https://doi.org/10.1002/(SICI)1099-1026(199907/08)14:4<219::AID-FFJ815>3.0.CO;2-# . [all data]

Weyerstahl, Marschall, et al., 1997
Weyerstahl, P.; Marschall, H.; Seelmann, I.; Kaul, V.K., Constituents of the flower essential oil of Ageratina adenophora (Spreng.) K. et R. from India, Flavour Fragr. J., 1997, 12, 6, 387-396, https://doi.org/10.1002/(SICI)1099-1026(199711/12)12:6<387::AID-FFJ677>3.0.CO;2-F . [all data]