Tetra-p-tolylethene

Condensed phase thermochemistry data

Data compiled by: Hussein Y. Afeefy, Joel F. Liebman, and Stephen E. Stein

Quantity Value Units Method Reference Comment
Δcsolid-15978.4 ± 4.0kJ/molCcbCoops, Hoijtink, et al., 1953Reanalyzed by Cox and Pilcher, 1970, Original value = -15977. ± 4. kJ/mol; Corresponding Δfsolid = 171.5 kJ/mol (simple calculation by NIST; no Washburn corrections)

References

Coops, Hoijtink, et al., 1953
Coops, J.; Hoijtink, G.J.; Kramer, Th.J.E.; Faber, A.C., Thermochemical investigations on arylethenes. II. Heats of combustion of some para and orthotolylethenes and phenylbutadienes, Rec. Trav. Chim. Pays/Bas, 1953, 72, 765. [all data]

Cox and Pilcher, 1970
Cox, J.D.; Pilcher, G., Thermochemistry of Organic and Organometallic Compounds, Academic Press, New York, 1970, 1-636. [all data]