1-Butanone, 1-(4-fluorophenyl)-

Gas phase ion energetics data

Data compiled by: Henry M. Rosenstock, Keith Draxl, Bruce W. Steiner, and John T. Herron

Ionization energy determinations

IE (eV) Method Reference
9.1 ± 0.2EIMcLafferty and Wachs, 1967

References

McLafferty and Wachs, 1967
McLafferty, F.W.; Wachs, T., Substituent effects in unimolecular ion decompositions. IX. Specific hydrogenrearrangement in butyrophenones, J. Am. Chem. Soc., 1967, 89, 5043. [all data]