Chlordiazepoxide

Van Den Dool and Kratz RI, non-polar column, custom temperature program

Data compiled by: NIST Mass Spectrometry Data Center, William E. Wallace, director

Column type Capillary
Active phase BP-1
Column length (m) 12.
Carrier gas He
Substrate
Column diameter (mm) 0.22
Phase thickness (μm) 0.25
Program 120C => 8C/min => 270C => 25C/min => 300C
I 2774.
ReferenceStowell and Wilson, 1987
Comment MSDC-RI

Van Den Dool and Kratz RI, non-polar column, temperature ramp

Data compiled by: NIST Mass Spectrometry Data Center, William E. Wallace, director

Column type CapillaryCapillaryCapillaryCapillaryCapillary
Active phase VF-5MSSPB-1CBP-1DB-1DB-1
Column length (m) 30.30.12.15.15.
Carrier gas HeHeN2HeHe
Substrate
Column diameter (mm) 0.250.750.530.320.25
Phase thickness (μm) 0.251.0 0.250.25
Tstart (C) 60.160.120.120.120.
Tend (C) 270.280.250.280.280.
Heat rate (K/min)  10.6.8.8.
Initial hold (min)
Final hold (min)  12. 5.5.
I 2926.42798.2764.2778.2778.
ReferenceTretyakov, 2014Christ, Noomano, et al., 1988Oyama, Sano, et al., 1987Perrigo, Peel, et al., 1985Perrigo, Ballantyne, et al., 1984
Comment MSDC-RI MSDC-RI MSDC-RI MSDC-RI MSDC-RI

Normal alkane RI, non-polar column, temperature ramp

Data compiled by: NIST Mass Spectrometry Data Center, William E. Wallace, director

Column type PackedCapillaryCapillaryPackedPacked
Active phase SE-30BP-1DB-5SE-30OV-1
Column length (m) 2. 15.2.2.
Carrier gas Nitrogen HeHe
Substrate Chromosorb G AW DMCS (80-100 mesh)  Chromosorb W(100-120 mesh)Gas Chrom P
Column diameter (mm)   0.25
Phase thickness (μm)   0.25
Tstart (C) 100.100.150.200.150.
Tend (C) 300.300.260.285.300.
Heat rate (K/min)   10.4.5.
Initial hold (min)   1.2.
Final hold (min)    10.
I 2799.2815.2815.2808.2820.
ReferenceMHA, 9999MHA, 9999Zamechnik, Ethier, et al., 1989Chiarotti, de Giovanni, et al., 1986Marozzi, Gambaro, et al., 1982
Comment MSDC-RI MSDC-RI MSDC-RI MSDC-RI MSDC-RI
Column type Packed
Active phase SE-30
Column length (m) 2.
Carrier gas
Substrate Gas Chrom P
Column diameter (mm)
Phase thickness (μm)
Tstart (C) 150.
Tend (C) 300.
Heat rate (K/min) 5.
Initial hold (min)
Final hold (min)
I 2820.
ReferenceMarozzi, Gambaro, et al., 1982
Comment MSDC-RI

References

Stowell and Wilson, 1987
Stowell, A.; Wilson, L.W., A simple approach to the interlaboratory transfer of drug retention indices determined by temperature programmed capillary gas chromatography, J. Forensic Sci., 1987, 32, 5, 1214-1220. [all data]