Bis(methylammonium) hexachloroplatinate

Condensed phase thermochemistry data

Data compiled by: Eugene S. Domalski and Elizabeth D. Hearing

Quantity Value Units Method Reference Comment
solid,1 bar106.44cal/mol*KN/AKume, Matsuo, et al., 1991

Constant pressure heat capacity of solid

Cp,solid (cal/mol*K) Temperature (K) Reference Comment
69.792298.15Kume, Matsuo, et al., 1991T = 5 to 300 K.

References

Kume, Matsuo, et al., 1991
Kume, Y.; Matsuo, T.; Suga, H., Calorimetric, spectroscopic and dielectric studies of a phase transition in methylammonium hexachloroplatinate, Thermochim. Acta, 1991, 183, 245-268. [all data]