Dibenzo-p-dioxin, 1,2,3,4,6,7,9-heptachloro-

Van Den Dool and Kratz RI, non-polar column, temperature ramp

Data compiled by: NIST Mass Spectrometry Data Center, William E. Wallace, director

Column type Capillary
Active phase DB-5
Column length (m) 60.
Carrier gas He
Substrate
Column diameter (mm) 0.252
Phase thickness (μm) 0.25
Tstart (C) 170.
Tend (C) 340.
Heat rate (K/min) 2.
Initial hold (min) 1.
Final hold (min)
I 2949.
ReferenceDonnelly, Munslow, et al., 1987
Comment MSDC-RI

Phase change data

Data compiled by: William E. Acree, Jr., James S. Chickos

Enthalpy of sublimation

ΔsubH (kcal/mol) Temperature (K) Method Reference Comment
34.46 ± 0.07435.MELi, Shibata, et al., 2004Based on data from 418. - 453. K.

References

Donnelly, Munslow, et al., 1987
Donnelly, J.R.; Munslow, W.D.; Mitchum, R.K.; Sovocool, G.W., Correlation of structure with rentention index for chlorinated dibenzo-p-dioxins, J. Chromatogr., 1987, 392, 51-63, https://doi.org/10.1016/S0021-9673(01)94253-0 . [all data]