17α-Methyltestosterone

Phase change data

Data compiled by: William E. Acree, Jr., James S. Chickos

Enthalpy of fusion

ΔfusH (kJ/mol) Temperature (K) Reference
27.8439.Cenuse and Meltzer, 1997

References

Cenuse and Meltzer, 1997
Cenuse, Z.; Meltzer, V., DSC characterization of drugs containing cyclopentanophenanthrene nucleus, An. Univ. Bucuresti. Chimie, 1997, 6, 101. [all data]