Co(CO)2

Gas phase ion energetics data

Data compiled by: John E. Bartmess

Electron affinity determinations

EA (eV) Method Reference Comment
<1.79961IMRBMcElvaney and Allison, 1986Order: Cr(CO)3 < Co(CO)2 < Co(CO)(NO) < Co(CO)3 < Fe(CO)3 = 41.5 kcal/mol

References

McElvaney and Allison, 1986
McElvaney, S.W.; Allison, J., Gas-phase chemistry of transition-metal-containing anions with alcohols, chloroalkanes, and bifunctional organic molecules, Organometallics, 1986, 5, 416. [all data]