ortho-Methoxyacetophenone

Normal alkane RI, polar column, custom temperature program

Data compiled by: NIST Mass Spectrometry Data Center, William E. Wallace, director

Column type CapillaryCapillaryCapillary
Active phase BP-20Carbowax 20MCarbowax 20M
Column length (m) 30.
Carrier gas He He
Substrate
Column diameter (mm) 0.25
Phase thickness (μm) 0.25
Program 50C(1min) => 2.5C/min => 100C => 2C/min => 180C => 15C/min => 220Cnot specifiednot specified
I 1971.1975.2020.
ReferencePontes, Marques, et al., 2007Vinogradov, 2004Peppard and Ramus, 1988
Comment MSDC-RI MSDC-RI MSDC-RI

Van Den Dool and Kratz RI, non-polar column, temperature ramp

Data compiled by: NIST Mass Spectrometry Data Center, William E. Wallace, director

Column type Capillary
Active phase OV-1
Column length (m) 25.
Carrier gas He
Substrate
Column diameter (mm) 0.32
Phase thickness (μm)
Tstart (C) 40.
Tend (C) 280.
Heat rate (K/min) 8.
Initial hold (min)
Final hold (min) 10.
I 1250.
ReferenceTan, Holland, et al., 1988
Comment MSDC-RI

References

Pontes, Marques, et al., 2007
Pontes, M.; Marques, J.C.; Camara, J.S., Screening of volatile composition from Portuguese multifloral honeys using headspace solid-phase microextraction-gas chromatography-quadrupole mass spectrometry, Talanta, 2007, 74, 1, 91-103, https://doi.org/10.1016/j.talanta.2007.05.037 . [all data]

Vinogradov, 2004
Vinogradov, B.A., Production, composition, properties and application of essential oils, 2004, retrieved from http://viness.narod.ru. [all data]

Peppard and Ramus, 1988
Peppard, T.L.; Ramus, S.A., Use of Kovats' gas chromatographic retention indices in beer flavor studies, Am. Soc. Brew. Chem. Proc., 1988, 46, 2, 26-30. [all data]