9(10H)-Acridinone
- Formula: C13H9NO
- Molecular weight: 195.2167
- IUPAC Standard InChIKey: FZEYVTFCMJSGMP-UHFFFAOYSA-N
- CAS Registry Number: 578-95-0
- Chemical structure:

Gas phase thermochemistry data

Data compiled by: Hussein Y. Afeefy, Joel F. Liebman, and Stephen E. Stein
Quantity | Value | Units | Method | Reference | Comment |
---|---|---|---|---|---|
ΔfH°gas | 8.27 ± 0.62 | kcal/mol | Ccr | Sabbah and El Watik, 1992 | Published also in Calorim. Anal. Therm. 23,477 1992 |

Condensed phase thermochemistry data

Data compiled by: Hussein Y. Afeefy, Joel F. Liebman, and Stephen E. Stein
Quantity | Value | Units | Method | Reference | Comment |
---|---|---|---|---|---|
ΔfH°solid | -24.28 ± 0.62 | kcal/mol | Ccr | Sabbah and El Watik, 1992 | Published also in Calorim. Anal. Therm. 23,477 1992 |
Quantity | Value | Units | Method | Reference | Comment |
ΔcH°solid | -1505.8 ± 0.60 | kcal/mol | Ccr | Sabbah and El Watik, 1992 | Published also in Calorim. Anal. Therm. 23,477 1992 |

Phase change data

Data compiled as indicated in comments:
ALS - Hussein Y. Afeefy, Joel F. Liebman, and Stephen E. Stein
AC - William E. Acree, Jr., James S. Chickos
Quantity | Value | Units | Method | Reference | Comment |
---|---|---|---|---|---|
ΔsubH° | 32.54 ± 0.11 | kcal/mol | C | Sabbah and El Watik, 1992 | Published also in Calorim. Anal. Therm. 23,477 1992; ALS |
ΔsubH° | 32.6 ± 0.1 | kcal/mol | C | Sabbah and Watik, 1992 | AC |
Enthalpy of fusion
ΔfusH (kcal/mol) | Temperature (K) | Method | Reference | Comment |
---|---|---|---|---|
7.77 | 640. | DSC | Storoniak, Krzyminski, et al., 2003 | AC |

Normal alkane RI, non-polar column, custom temperature program

Column type | Active phase | I | Reference | Comment |
---|---|---|---|---|
Capillary | Polydimethyl siloxane, unknown content of Ph-groups | 2362. | Geldon, 1989 | Program: not specified |

Reaction thermochemistry data

Data compiled by: John E. Bartmess

Individual Reactions

C13H8NO- + Hydrogen cation = 9(10H)-Acridinone

By formula: C13H8NO- + H+ = C13H9NO

Quantity Value Units Method Reference Comment
Δr1360. ± 42.kJ/molEIAEMuftakhov, Vasil'ev, et al., 1999gas phase

References

Sabbah and El Watik, 1992
Sabbah, R.; El Watik, L.,
Etude thermodynamique de l'acridone et de la thioxanthone,
Can. J. Chem., 1992, 70, 24-28. [all data]
Sabbah and Watik, 1992
Sabbah, Raphaël; Watik, Lahcen El,
Étude thermodynamique de l'acridone et de la thioxanthone,
Can. J. Chem., 1992, 70, 1, 24-28, https://doi.org/10.1139/v92-005
. [all data]
Storoniak, Krzyminski, et al., 2003
Storoniak, P.; Krzyminski, K.; Bouzyk, A.; Koval'chuk, E.P.; Blazejowski, J.,
Melting, volatilisation and crystal lattice enthalpies of acridin-9(10H)-ones,
Journal of Thermal Analysis and Calorimetry, 2003, 74, 2, 443-450, https://doi.org/10.1023/B:JTAN.0000005179.91819.6d
. [all data]
Geldon, 1989
Geldon, A.L.,
Ground Water Hydrology of the Central Raton Basin, Colorado and New Mexico, US Geological Survey, US Government Printing Office, 1989, 104. [all data]