Cholesterol

Kovats' RI, non-polar column, custom temperature program

Data compiled by: NIST Mass Spectrometry Data Center, William E. Wallace, director

Column type PackedPacked
Active phase SE-30OV-1
Column length (m) 1.52.
Carrier gas HeN2
Substrate Chromosorb G HP (80-100 mesh)Chromosorb G, AW-DMCS
Column diameter (mm)
Phase thickness (μm)
Program not specifiednot specified
I 3008.3090.
ReferenceRamsey, Lee, et al., 1980Berninger, Grunnagel, et al., 1975
Comment MSDC-RI MSDC-RI

Normal alkane RI, non-polar column, temperature ramp

Data compiled by: NIST Mass Spectrometry Data Center, William E. Wallace, director

Column type CapillaryPackedPacked
Active phase DB-1SE-30SE-30
Column length (m) 30.2.2.
Carrier gas HeliumNitrogenN2
Substrate  Chromosorb W AW DMS (80-100 mesh)Chromosorb W AW DMS
Column diameter (mm) 0.25
Phase thickness (μm) 0.25
Tstart (C) 50.130.130.
Tend (C) 250.290.290.
Heat rate (K/min) 10.8.8.
Initial hold (min)  2.2.
Final hold (min)  8.8.
I 3098.3080.3080.
ReferenceSteiger, Haberer, et al., 2011Peel and Perrigo, 1976Peel and Perrigo, 1975
Comment MSDC-RI MSDC-RI MSDC-RI

References

Ramsey, Lee, et al., 1980
Ramsey, J.D.; Lee, T.D.; Osselton, M.D.; Moffat, A.C., Gas-liquid chromatographic retention indices of 296 non-drug substances on SE-30 or OV-1 likely to be encountered in toxicological analyses, J. Chromatogr., 1980, 184, 2, 185-206, https://doi.org/10.1016/S0021-9673(00)85641-1 . [all data]

Berninger, Grunnagel, et al., 1975
Berninger, H.; Grunnagel, R.; Mall, S.; Moller, M.R., Gas chromatographic identification of unknown substances from body fluids by menas of retention indices, Beitr. Gerichtl. Med., 1975, 33, 185-191. [all data]