1-Ethylcyclopropanol

Normal alkane RI, polar column, custom temperature program

Data compiled by: NIST Mass Spectrometry Data Center, William E. Wallace, director

Column type Capillary
Active phase HP-Innowax
Column length (m) 60.
Carrier gas Helium
Substrate
Column diameter (mm) 0.25
Phase thickness (μm) 0.25
Program not specified
I 1181.
ReferenceFeng, Zhuang, et al., 2011
Comment MSDC-RI

References

Feng, Zhuang, et al., 2011
Feng, T.; Zhuang, H.; Ye, R.; Jin, Z.; Xu, X.; Xie, Z., Analysis of volatile compounds of Mesona Blumes gum/rice extrudates via GC-MS and electronic nose, Sensors and Actuators B: Chemical, 2011, 160, 1, 964-973, https://doi.org/10.1016/j.snb.2011.09.013 . [all data]