Chromium, bis(1,3-dichlorobenzene)-

Gas phase ion energetics data

Data compiled by: Sharon G. Lias, John E. Bartmess, Joel F. Liebman, John L. Holmes, Rhoda D. Levin, and W. Gary Mallard

Ionization energy determinations

IE (eV) Method Reference Comment
6.20PECabelli, Cowley, et al., 1982Vertical value

References

Cabelli, Cowley, et al., 1982
Cabelli, D.E.; Cowley, A.H.; Lagowski, J.J., The bonding in some bis(arene)chromium compounds as indicated by U. V. photoelectron zpectroscopy, Inorg. Chim. Acta, 1982, 57, 195. [all data]