Thiophene, 2-(methylthio)-

Gas phase ion energetics data

Data compiled by: Sharon G. Lias, Rhoda D. Levin, and Sherif A. Kafafi

Ionization energy determinations

IE (eV) Method Reference Comment
8.10 ± 0.05EILinda, Marino, et al., 1971
8.63 ± 0.05PEFringuelli, Marino, et al., 1976Vertical value

Normal alkane RI, non-polar column, custom temperature program

Data compiled by: NIST Mass Spectrometry Data Center, William E. Wallace, director

Column type Capillary
Active phase OV-1, SE-30, Methyl silicone, SP-2100, OV-101, DB-1, etc.
Column length (m) 50.
Carrier gas Hydrogen
Substrate
Column diameter (mm) 0.32
Phase thickness (μm)
Program not specified
I 1020.
ReferenceWaggott and Davies, 1984
Comment MSDC-RI

References

Linda, Marino, et al., 1971
Linda, P.; Marino, G.; Pignataro, S., A comparison of sensitivities to substituent effects of five- membered heteroaromatic rings in gas phase ionization, J. Chem. Soc. B, 1971, 1585. [all data]

Fringuelli, Marino, et al., 1976
Fringuelli, F.; Marino, G.; Taticchi, A.; Distefano, G.; Colonna, F.P.; Pignataro, S., Photoelectron spectra of the α-substituted derivatives of furan, thiophen, selenophen, and tellurophen. A comparative study of the molecular orbital energies, J. Chem. Soc. Perkin Trans. 2, 1976, 276. [all data]