Benzaldehyde, 3,5-dimethyl-

Normal alkane RI, non-polar column, temperature ramp

Data compiled by: NIST Mass Spectrometry Data Center, William E. Wallace, director

Column type CapillaryCapillary
Active phase HP-5 MSOV-101
Column length (m) 30.50.
Carrier gas HeliumHe
Substrate
Column diameter (mm) 0.250.32
Phase thickness (μm) 0.250.5
Tstart (C) 35.50.
Tend (C) 195.250.
Heat rate (K/min) 2.4.
Initial hold (min) 5.
Final hold (min) 30.
I 1169.1149.
ReferenceKim and Chung, 2009Misharina, Golovnya, et al., 1991
Comment MSDC-RI MSDC-RI

Normal alkane RI, polar column, custom temperature program

Data compiled by: NIST Mass Spectrometry Data Center, William E. Wallace, director

Column type Capillary
Active phase SOLGel-Wax
Column length (m) 30.
Carrier gas Helium
Substrate
Column diameter (mm) 0.25
Phase thickness (μm) 0.25
Program 40 0C (2 min) 5 0C/min -> 140 0C 10 0C/min -> 250 0C (3 min)
I 1837.
ReferenceJohanningsmeier and McFeeters, 2011
Comment MSDC-RI

References

Kim and Chung, 2009
Kim, J.-S.; Chung, H.Y., GC-MS analysis of the volatile components in dried boxthorn (Lycium chimensis) Fruit, J. Korean Soc. Appl. Biol. Chem., 2009, 52, 5, 516-524, https://doi.org/10.3839/jksabc.2009.088 . [all data]

Misharina, Golovnya, et al., 1991
Misharina, T.A.; Golovnya, R.V.; Charnomskii, V.V., Volatile components of boiled shrimp funchalia woodwardi and crab geryon maritae, Zh. Anal. Khim., 1991, 46, 1421-1429. [all data]