Ethanone, 1-(2-methylphenyl)-

Normal alkane RI, non-polar column, temperature ramp

Data compiled by: NIST Mass Spectrometry Data Center, William E. Wallace, director

Column type CapillaryCapillary
Active phase DB-5BP-1
Column length (m) 30.25.
Carrier gas H2Nitrogen
Substrate
Column diameter (mm) 0.250.33
Phase thickness (μm) 0.251.00
Tstart (C) 60.30.
Tend (C) 280.150.
Heat rate (K/min) 4.5.
Initial hold (min) 10.4.
Final hold (min) 40.
I 1139.1108.
ReferencePino, Marbot, et al., 2003Wilkins and Scholl, 1989
Comment MSDC-RI MSDC-RI

Van Den Dool and Kratz RI, polar column, custom temperature program

Data compiled by: NIST Mass Spectrometry Data Center, William E. Wallace, director

Column type Capillary
Active phase Carbowax 20M
Column length (m) 150.
Carrier gas
Substrate
Column diameter (mm) 0.75
Phase thickness (μm)
Program not specified
I 1690.
ReferenceWhitfield, Shea, et al., 1981
Comment MSDC-RI

Kovats' RI, non-polar column, temperature ramp

Data compiled by: NIST Mass Spectrometry Data Center, William E. Wallace, director

Column type Capillary
Active phase BP-1
Column length (m) 50.
Carrier gas He
Substrate
Column diameter (mm)
Phase thickness (μm)
Tstart (C) -100.
Tend (C) 200.
Heat rate (K/min) 2.
Initial hold (min)
Final hold (min)
I 1110.
ReferenceBartley, 1988
Comment MSDC-RI

Normal alkane RI, polar column, temperature ramp

Data compiled by: NIST Mass Spectrometry Data Center, William E. Wallace, director

Column type CapillaryCapillary
Active phase TC-WaxCarbowax 20M
Column length (m) 60.50.
Carrier gas  He
Substrate
Column diameter (mm) 0.250.25
Phase thickness (μm)
Tstart (C) 80.60.
Tend (C) 240.180.
Heat rate (K/min) 3.2.
Initial hold (min) 5.4.
Final hold (min)
I 1686.1738.
ReferenceShuichi, Masazumi, et al., 1996Kawakami, Kobayashi, et al., 1993
Comment MSDC-RI MSDC-RI

References

Pino, Marbot, et al., 2003
Pino, J.A.; Marbot, R.; Fuentes, V., Characterization of volatiles in Bullock's heart (Annona reticulata L.) fruit cultivars from Cuba, J. Agric. Food Chem., 2003, 51, 13, 3836-3839, https://doi.org/10.1021/jf020733y . [all data]

Wilkins and Scholl, 1989
Wilkins, C.K.; Scholl, S., Volatile metabolites of some barley storage molds, Internat. J. Food Microbiol., 1989, 8, 1, 11-17, https://doi.org/10.1016/0168-1605(89)90075-5 . [all data]