2-Propanone, methylhydrazone

Gas phase ion energetics data

Data compiled by: Sharon G. Lias, Rhoda D. Levin, and Sherif A. Kafafi

Ionization energy determinations

IE (eV) Method Reference
7.69PEZverev, Vovna, et al., 1973

Normal alkane RI, non-polar column, temperature ramp

View large format table.

Column type Active phase I Reference Comment
CapillaryOV-101728.Zenkevich, 200525. m/0.20 mm/0.10 μm, N2/He, 6. K/min; Tstart: 50. C; Tend: 250. C

References

Zverev, Vovna, et al., 1973
Zverev, V.V.; Vovna, V.I.; El'man, M.S.; Kitaev, Yu.P.; Vilesov, F.I., Photolectron spectra and spatial structure of acyclic azines, Dokl. Phys. Chem., 1973, 213, 945, In original 1319. [all data]