8-Ethyltheophylline

Phase change data

Data compiled as indicated in comments:
TRC - Thermodynamics Research Center, NIST Boulder Laboratories, Chris Muzny director
AC - William E. Acree, Jr., James S. Chickos

Quantity Value Units Method Reference Comment
Tfus545.2KN/AGondova, Kralik, et al., 1989Uncertainty assigned by TRC = 0.5 K; TRC
Tfus537.0KN/ASalas-Peregrin, Colacio-Rodriguez, et al., 1984Uncertainty assigned by TRC = 0.2 K; TRC

Enthalpy of fusion

ΔfusH (kJ/mol) Temperature (K) Method Reference Comment
37.2545.3DSCGondová, Králik, et al., 1989AC

In addition to the Thermodynamics Research Center (TRC) data available from this site, much more physical and chemical property data is available from the following TRC products:

References

Gondova, Kralik, et al., 1989
Gondova, T.; Kralik, P.; Gonda, J., Determination of some thermodynamic characteristics of melting of 8-alkyltheophyllines by the DSC method, Thermochim. Acta, 1989, 156, 1, 147, https://doi.org/10.1016/0040-6031(89)87180-1 . [all data]

Salas-Peregrin, Colacio-Rodriguez, et al., 1984
Salas-Peregrin, J.M.; Colacio-Rodriguez, E.; Girela-Vilchez, F.; Roldan-Medina, M., thermal studies on purine complexes. VII. 8-theophylline derivatives and their silver(I) complexes, Thermochim. Acta, 1984, 80, 323. [all data]

Gondová, Králik, et al., 1989
Gondová, T.; Králik, P.; Gonda, J., Determination of some thermodynamic characteristics of melting of 8-alkyltheophyllines by the DSC method, Thermochimica Acta, 1989, 156, 1, 147-155, https://doi.org/10.1016/0040-6031(89)87180-1 . [all data]