Tridecanone-

Van Den Dool and Kratz RI, non-polar column, temperature ramp

Data compiled by: NIST Mass Spectrometry Data Center, William E. Wallace, director

Column type Capillary
Active phase DB-5
Column length (m) 30.
Carrier gas H2
Substrate
Column diameter (mm) 0.25
Phase thickness (μm) 0.25
Tstart (C) 50.
Tend (C) 290.
Heat rate (K/min) 4.
Initial hold (min)
Final hold (min)
I 1505.
Referenceda Silva, Borba, et al., 1999
Comment MSDC-RI

References

da Silva, Borba, et al., 1999
da Silva, U.F.; Borba, E.L.; Semir, J.; Marsaioli, A.J., A simple solid injection device for the analyses of Bulbophyllum (Orchidaceae) volatiles, Phytochemistry, 1999, 50, 1, 31-34, https://doi.org/10.1016/S0031-9422(98)00459-2 . [all data]