6H,13H-Dipyridazino(1,2-a:1',2'-d)-s-tetrazine, octahydro-

Gas phase ion energetics data

Data compiled by: Sharon G. Lias, Rhoda D. Levin, and Sherif A. Kafafi

Ionization energy determinations

IE (eV) Method Reference Comment
7.46PERademacher, Breier, et al., 1979Vertical value

References

Rademacher, Breier, et al., 1979
Rademacher, P.; Breier, H.; Poppek, R., Photoelektronenspektren und Konformationen bi- und tricyclischer Hexahydro-1,2,4,5-tetrazine, Chem. Ber., 1979, 112, 853. [all data]