Ethinyl Estradiol

Phase change data

Data compiled as indicated in comments:
TRC - Thermodynamics Research Center, NIST Boulder Laboratories, Chris Muzny director
AC - William E. Acree, Jr., James S. Chickos

Quantity Value Units Method Reference Comment
Tfus459.KN/AGrady, Hays, et al., 1973Uncertainty assigned by TRC = 1. K; TRC

Enthalpy of fusion

ΔfusH (kcal/mol) Temperature (K) Reference Comment
6.589456.2van Laarhoven, Kruft, et al., 2002AC

In addition to the Thermodynamics Research Center (TRC) data available from this site, much more physical and chemical property data is available from the following TRC products:

References

Grady, Hays, et al., 1973
Grady, L.T.; Hays, S.E.; King, R.H.; Klein, H.R.; Mader, W.J.; Wyatt, D.K.; Zimmere, R.O., Drug purity profiles, J. Pharm. Sci., 1973, 62, 459. [all data]

van Laarhoven, Kruft, et al., 2002
van Laarhoven, J.A.H.; Kruft, M.A.B.; Vromans, H., In vitro release properties of etonogestrel and ethinyl estradiol from a contraceptive vaginal ring, International Journal of Pharmaceutics, 2002, 232, 1-2, 163-173, https://doi.org/10.1016/S0378-5173(01)00900-0 . [all data]