3-Pentanethiol-2,2,4,4-tetramethyl-

Gas phase ion energetics data

Data compiled by: Sharon G. Lias and Joel F. Liebman

Ionization energy determinations

IE (eV) Method Reference Comment
8.73 ± 0.05PEBlock, Yencha, et al., 1988Vertical value

References

Block, Yencha, et al., 1988
Block, E.; Yencha, A.J.; Aslam, M.; Eswarakrishnan, V.; Luo, J.; Sano, A., Gas-phase determination of the geometric requirements of the silicon B-effect. Photoelectron and penning ionization electron spectroscopic study of silylthiiranes and -oxiranes. Synthesis and chemistry of trans-2,3-bis(trimethylsilyl)thiirane, J. Am. Chem. Soc., 1988, 110, 4748. [all data]