Tetrasulfide, dimethyl

Normal alkane RI, non-polar column, custom temperature program

Data compiled by: NIST Mass Spectrometry Data Center, William E. Wallace, director

Column type CapillaryCapillaryCapillaryCapillaryCapillary
Active phase HP-1HP-5 MSHP-1SE-30SPB-5
Column length (m) 50.30.25. 60.
Carrier gas Helium
Substrate
Column diameter (mm) 0.200.250.2 0.32
Phase thickness (μm) 0.330.250.11 1.
Program not specified40 0C (3 min) 2 0C/min -> 150 0C 20 0C/min -> 220 0C (5 min)35C(3min) => 4C/min => 190C => 30C/min => 225C(3min)not specifiednot specified
I 1188.1203.1173.1192.1237.
ReferenceBreme, Langle, et al., 2008Pyun and Shin, 2006Carpino, Mallia, et al., 2004Vinogradov, 2004Begnaud, Pérès, et al., 2003
Comment MSDC-RI MSDC-RI MSDC-RI MSDC-RI MSDC-RI
Column type CapillaryCapillaryCapillaryCapillaryCapillary
Active phase BPX-5CP Sil 8 CBCP Sil 5 CBDB-5 MSCP Sil 5 CB
Column length (m) 60.60.50.30.50.
Carrier gas He  HeliumHe
Substrate
Column diameter (mm) 0.320.250.320.250.32
Phase thickness (μm) 1.0.251.21.01.2
Program 40C (4min) => 2C/min => 90C => 4C/min => 130C => 8C/min => 250 C (10min)not specified36C => 20C/min => 120C(20min) => 2C/min => 250C(30min)not specified33C (16.5min) => 2C/min => 160C => 20C/min => 200C (9min)
I 1234.1242.1203.1239.1208.
ReferenceMachiels, van Ruth, et al., 2003Duckham, Dodson, et al., 2001Lermusieau, Bulens, et al., 2001Luo and Agnew, 2001Gijs, Piraprez, et al., 2000
Comment MSDC-RI MSDC-RI MSDC-RI MSDC-RI MSDC-RI
Column type CapillaryCapillary
Active phase RTX-5OV-1, SE-30, Methyl silicone, SP-2100, OV-101, DB-1, etc.
Column length (m)  50.
Carrier gas  Hydrogen
Substrate
Column diameter (mm)  0.32
Phase thickness (μm)
Program not specifiednot specified
I 1232.1202.
ReferenceMasanetz, Guth, et al., 1998Waggott and Davies, 1984
Comment MSDC-RI MSDC-RI

Van Den Dool and Kratz RI, polar column, temperature ramp

Data compiled by: NIST Mass Spectrometry Data Center, William E. Wallace, director

Column type CapillaryCapillaryCapillaryCapillaryCapillary
Active phase CP-Wax 52CBCP-Wax 52CBFFAPDB-WaxDB-Wax
Column length (m) 50.50.30.60.30.
Carrier gas   He He
Substrate
Column diameter (mm) 0.320.320.250.250.32
Phase thickness (μm)   0.250.250.25
Tstart (C) 60.60.40.40.40.
Tend (C) 220.220.220.200.200.
Heat rate (K/min) 4.4.5.3.6.
Initial hold (min) 5.5.3.5.5.
Final hold (min) 30.30. 60.30.
I 1735.1721.1763.1750.1742.
ReferenceMahadevan and Farmer, 2006Mahadevan and Farmer, 2006Calvo-Gómez, Morales-López, et al., 2004Cha, Kim, et al., 1998Cha, Kim, et al., 1998
Comment MSDC-RI MSDC-RI MSDC-RI MSDC-RI MSDC-RI

Normal alkane RI, non-polar column, temperature ramp

Data compiled by: NIST Mass Spectrometry Data Center, William E. Wallace, director

Column type CapillaryCapillaryCapillaryCapillaryCapillary
Active phase Optima-5 MSHP-5 MSHP-1HP-1DB-1
Column length (m) 30.30.50.50.30.
Carrier gas HeliumHeliumHeliumHeliumHe
Substrate
Column diameter (mm) 0.250.250.200.200.25
Phase thickness (μm) 0.250.250.330.330.25
Tstart (C) 35.50.60.60.50.
Tend (C) 250.320.250.250.265.
Heat rate (K/min) 10.5.2.2.2.5
Initial hold (min) 3.5.  1.
Final hold (min) 5. 20.20.20.
I 1215.1206.1181.1190.1168.
ReferenceGoeminne, Vandendriessche, et al., 2012Nawrath, Mgode, et al., 2012Breme, Langle, et al., 2008Breme, Langle, et al., 2008Iranshahi, Amin, et al., 2006
Comment MSDC-RI MSDC-RI MSDC-RI MSDC-RI MSDC-RI
Column type CapillaryCapillaryCapillaryCapillaryCapillary
Active phase HP-1BPX-5MDN-5HP-5MSHP-1
Column length (m) 50.25.60.30.50.
Carrier gas HeHeHeHeHe
Substrate
Column diameter (mm) 0.20.220.250.250.2
Phase thickness (μm) 0.50.250.250.250.5
Tstart (C) 60.50.40.60.60.
Tend (C) 250.320.270.275.220.
Heat rate (K/min) 2.5.4.4.2.
Initial hold (min)  5.4.
Final hold (min) 60. 5. 40.
I 1190.1235.1241.1224.1187.
ReferenceBendimerad and Bendiab, 2005Dickschat, Martens, et al., 2005van Loon, Linssen, et al., 2005Sadraei, Ghannadi, et al., 2003Valette, Fernandez, et al., 2003
Comment MSDC-RI MSDC-RI MSDC-RI MSDC-RI MSDC-RI
Column type CapillaryCapillaryCapillaryCapillaryCapillary
Active phase DB-5DB-1DB-1SE-54DB-1
Column length (m) 30.30.30.30.30.
Carrier gas HeHeHe He
Substrate
Column diameter (mm) 0.250.20.20.520.25
Phase thickness (μm) 0.250.250.251.50.25
Tstart (C) 60.50.50.5.35.
Tend (C) 240.200.200.230.150.
Heat rate (K/min) 3.4.4.6.5.
Initial hold (min)  2.2.
Final hold (min)
I 1210.1218.1207.1212.1205.
ReferenceTellez, Schrader, et al., 2001Rapior, Breheret, et al., 1997Rapior, Breheret, et al., 1997Milo and Grosch, 1996Hanum, Sinha, et al., 1995
Comment MSDC-RI MSDC-RI MSDC-RI MSDC-RI MSDC-RI
Column type CapillaryCapillaryCapillaryCapillaryCapillary
Active phase RTX-5DB-1DB-1DB-1DB-5
Column length (m) 30.60.60.60.30.
Carrier gas HeHeHeHeHe
Substrate
Column diameter (mm) 0.520.250.250.320.2
Phase thickness (μm) 1.51.1.0.25
Tstart (C) 5.40.40.60.30.
Tend (C) 230.260.260.220.200.
Heat rate (K/min) 6.2.2.3.2.
Initial hold (min)  5.5.
Final hold (min)  60.60.
I 1232.1206.1202.1188.1215.
ReferenceMilo and Grosch, 1995Yu and Ho, 1995Yu, Wu, et al., 1994Güntert, Bertram, et al., 1992Sinha, Guyer, et al., 1992
Comment MSDC-RI MSDC-RI MSDC-RI MSDC-RI MSDC-RI
Column type Capillary
Active phase DB-5
Column length (m) 30.
Carrier gas He
Substrate
Column diameter (mm) 0.2
Phase thickness (μm)
Tstart (C) 30.
Tend (C) 200.
Heat rate (K/min) 2.
Initial hold (min)
Final hold (min)
I 1225.
ReferenceSinha, Guyer, et al., 1992
Comment MSDC-RI

References

Breme, Langle, et al., 2008
Breme, K.; Langle, S.; Fernandez, X.; Meierhenrich, U.J.; Brevard, H.; Joulain, D., Character impact odorants from Brassicaceae by aroma extracts dilution analysis (AEDA): Brassica cretica and Brassica insularis, Flavour Fragr. J., 2008, 24, 2, 88-93, https://doi.org/10.1002/ffj.1912 . [all data]

Pyun and Shin, 2006
Pyun, M.-S.; Shin, S., Antifungal effects of the volatile oils from Allium plants against Trichophyton species and synergism of the oils with ketoconazole, Phytomedicine, 2006, 13, 6, 394-400, https://doi.org/10.1016/j.phymed.2005.03.011 . [all data]

Carpino, Mallia, et al., 2004
Carpino, S.; Mallia, S.; La Terra, S.; Melilli, C.; Licitra, G.; Acree, T.E.; Barbano, D.M.; van Soest, P.J., Composition and aroma compounds of ragusano cheese: native pasture and total mixed rations, J. Dairy Sci., 2004, 87, 4, 816-830, https://doi.org/10.3168/jds.S0022-0302(04)73226-9 . [all data]

Vinogradov, 2004
Vinogradov, B.A., Production, composition, properties and application of essential oils, 2004, retrieved from http://viness.narod.ru. [all data]

Begnaud, Pérès, et al., 2003
Begnaud, F.; Pérès, C.; Berdagué, J.-L., Characterization of volatile effluents of livestock buildings by solid-phase microextraction, Int. J. Environ. Anal. Chem., 2003, 83, 10, 837-849, https://doi.org/10.1080/03067310310001603349 . [all data]

Machiels, van Ruth, et al., 2003
Machiels, D.; van Ruth, S.M.; Posthumus, M.A.; Istasse, L., Gas chromatography-olfactometry analysis of the volatile compounds of two commercial Irish beef meats, Talanta, 2003, 60, 4, 755-764, https://doi.org/10.1016/S0039-9140(03)00133-4 . [all data]

Duckham, Dodson, et al., 2001
Duckham, S.C.; Dodson, A.T.; Bakker, J.; Ames, J.M., Volatile flavour components of baked potato flesh. A comparison of eleven potato cultivars, Nahrung/Food, 2001, 45, 5, 317-323, https://doi.org/10.1002/1521-3803(20011001)45:5<317::AID-FOOD317>3.0.CO;2-4 . [all data]

Lermusieau, Bulens, et al., 2001
Lermusieau, G.; Bulens, M.; Collin, S., Use of GC-olfactometry to identify the hop aromatic compounds in beer, J. Agric. Food Chem., 2001, 49, 8, 3867-3874, https://doi.org/10.1021/jf0101509 . [all data]

Luo and Agnew, 2001
Luo, J.; Agnew, M.P., Gas characteristics before and after biofiltration treating odorous emissions from animal rendering processes, Environ. Technol., 2001, 22, 9, 1091-1103, https://doi.org/10.1080/09593332208618220 . [all data]

Gijs, Piraprez, et al., 2000
Gijs, L.; Piraprez, G.; Perpète, P.; Spinnler, E.; Collin, S., Retention of sulfur flavours by food matrix and determination of sensorial data independent of the medium composition, Food Chem., 2000, 69, 3, 319-330, https://doi.org/10.1016/S0956-7135(99)00111-5 . [all data]

Masanetz, Guth, et al., 1998
Masanetz, C.; Guth, H.; Grosch, W., Fishy and hay-like off-flavours of dry spinach, Z. Lebensm. Unters. Forsch. A, 1998, 206, 2, 108-113, https://doi.org/10.1007/s002170050224 . [all data]

Waggott and Davies, 1984
Waggott, A.; Davies, I.W., Identification of organic pollutants using linear temperature programmed retention indices (LTPRIs) - Part II, 1984, retrieved from http://dwi.defra.gov.uk/research/completed-research/reports/dwi0383.pdf. [all data]