Trimethoxy[(phenylthio)methyl]silane

Phase change data

Data compiled by: William E. Acree, Jr., James S. Chickos

Quantity Value Units Method Reference Comment
Δvap56.4 ± 0.7kJ/molCVoronkov, Sorokin, et al., 1989

References

Voronkov, Sorokin, et al., 1989
Voronkov, M.G.; Sorokin, M.S.; Klyuchnikov, V.A.; Shvetz, G.N.; Pepekin, V.I., Thermochemistry of organosilicon compounds, Journal of Organometallic Chemistry, 1989, 359, 3, 301-313, https://doi.org/10.1016/0022-328X(89)88094-5 . [all data]