3(2H)-Thiophenone,2-methyl-5-(1-methylethyl)-

Gas phase ion energetics data

Data compiled by: Sharon G. Lias, Rhoda D. Levin, and Sherif A. Kafafi

Ionization energy determinations

IE (eV) Method Reference
8.21 ± 0.05EIThorstad, Undheim, et al., 1975

References

Thorstad, Undheim, et al., 1975
Thorstad, O.; Undheim, K.; Lantz, R.; Hornfeldt, A.-B., Ionisation potentials in tautomeric analysis of 3-hydroxy derivatives of thiophenes, selenophenes, and furans, Acta Chem. Scand., Ser. B, 1975, 29, 652. [all data]