(Z)-α-Damascone

Kovats' RI, non-polar column, temperature ramp

View large format table.

Column type Active phase I Reference Comment
CapillaryDB-51359.Buchin, Salmon, et al., 200260. m/0.32 mm/1. μm, He, 40. C @ 5. min, 3. K/min, 230. C @ 2. min

Van Den Dool and Kratz RI, non-polar column, temperature ramp

View large format table.

Column type Active phase I Reference Comment
CapillaryHP-5MS1354.Saroglou, Dorizas, et al., 200630. m/0.25 mm/0.25 μm, He, 60. C @ 5. min, 4. K/min; Tend: 280. C

Normal alkane RI, non-polar column, temperature ramp

View large format table.

Column type Active phase I Reference Comment
CapillaryHP-5MS1366.Melkani, Dev, et al., 200530. m/0.25 mm/0.25 μm, 50. C @ 10. min, 3. K/min, 250. C @ 5. min
CapillaryDB-51361.Morteza-Semnani and Saeedi, 200530. m/0.25 mm/0.25 μm, He, 60. C @ 4. min, 4. K/min; Tend: 220. C

References

Buchin, Salmon, et al., 2002
Buchin, S.; Salmon, J.-C.; Carnat, A.-P.; Berger, T.; Bugaud, C.; Bosset, J.O., Identification de composés monoterpéniques, sesquiterpéniques et benzéniques dans un lait d'alpage très riche en ces substances, Mitt. Lebensmittelunters. Hyg., 2002, 93, 199-216. [all data]

Saroglou, Dorizas, et al., 2006
Saroglou, V.; Dorizas, N.; Kypriotakis, Z.; Skaltsa, H.D., Analysis of the essential oil composition of eight Anthemis species from Greece, J. Chromatogr. A, 2006, 1104, 1-2, 313-322, https://doi.org/10.1016/j.chroma.2005.11.087 . [all data]

Melkani, Dev, et al., 2005
Melkani, A.B.; Dev, V.; Beauchamp, P.S.; Negi, A.; Mehta, S.P.S.; Melkani, K.B., Constituents of the essential oil of a new chemotype of Elsholtzia strobilifera Benth., Biochem. Syst. Ecol., 2005, 33, 4, 419-425, https://doi.org/10.1016/j.bse.2004.10.009 . [all data]

Morteza-Semnani and Saeedi, 2005
Morteza-Semnani, K.; Saeedi, M., The essential oil composition of Phlomis bruguieri Desf. from Iran, Flavour Fragr. J., 2005, 20, 3, 344-346, https://doi.org/10.1002/ffj.1459 . [all data]