(PO)2

Vibrational and/or electronic energy levels

Data compiled by: Marilyn E. Jacox

State:   X

Vib.
sym.
 No.   Approximate
 type of mode
 cm-1   Med.   Method   References

PO stretch 1155.0 Ar IR Mielke, McCluskey, et al., 1990

Additional references: Jacox, 1994, page 200

References

Mielke, McCluskey, et al., 1990
Mielke, Z.; McCluskey, M.; Andrews, L., Matrix reactions of P2 and O3 molecules, Chem. Phys. Lett., 1990, 165, 2-3, 146, https://doi.org/10.1016/0009-2614(90)85420-H . [all data]

Jacox, 1994
Jacox, M.E., Vibrational and electronic energy levels of polyatomic transient molecules, American Chemical Society, Washington, DC, 1994, 464. [all data]