Naphthalene, 1,7-dimethyl-
- Formula: C12H12
- Molecular weight: 156.2237
- IUPAC Standard InChIKey: SPUWFVKLHHEKGV-UHFFFAOYSA-N
- CAS Registry Number: 575-37-1
- Chemical structure:

Gas phase thermochemistry data

Data compiled by: Glushko Thermocenter, Russian Academy of Sciences, Moscow
Constant pressure heat capacity of gas
Cp,gas (J/mol*K) | Temperature (K) | Reference | Comment |
---|---|---|---|
45.7 | 50. | Thermodynamics Research Center, 1997 | p=1 bar. |
74.0 | 100. | ||
100. | 150. | ||
127.5 | 200. | ||
170.5 | 273.15 | ||
185.4 | 298.15 | ||
186.5 | 300. | ||
243.1 | 400. | ||
291.6 | 500. | ||
331.4 | 600. | ||
363.9 | 700. | ||
390.9 | 800. | ||
413.5 | 900. | ||
432.7 | 1000. | ||
449. | 1100. | ||
463. | 1200. | ||
475. | 1300. | ||
485. | 1400. | ||
494. | 1500. |

Phase change data

Data compiled as indicated in comments:
TRC - Thermodynamics Research Center, NIST Boulder Laboratories, Chris Muzny director
BS - Robert L. Brown and Stephen E. Stein
Quantity | Value | Units | Method | Reference | Comment |
---|---|---|---|---|---|
Tboil | 536.0 | K | N/A | Evans and Smith, 1953 | Uncertainty assigned by TRC = 1. K; TRC |
Tboil | 535.9 | K | N/A | Kruber and Oberkobusch, 1951 | Uncertainty assigned by TRC = 2. K; TRC |
Tboil | 536. | K | N/A | Bailey, Bryant, et al., 1947 | Uncertainty assigned by TRC = 4. K; TRC |
Tboil | 535. | K | N/A | Kruber and Schade, 1936 | Uncertainty assigned by TRC = 4. K; TRC |
Tboil | 531. | K | N/A | Barnett and Sanders, 1933 | Uncertainty assigned by TRC = 4. K; TRC |
Reduced pressure boiling point
Tboil (K) | Pressure (bar) | Reference | Comment |
---|---|---|---|
421.2 | 0.020 | Weast and Grasselli, 1989 | BS |

Kovats' RI, non-polar column, isothermal

Column type | Active phase | Temperature (C) | I | Reference | Comment |
---|---|---|---|---|---|
Capillary | Squalane | 120. | 1389.6 | Gerasimenko and Nabivach, 1997 | Column length: 50. m |
Capillary | OV-1 | 150. | 1414. | Zhang, Chen, et al., 1997 | 25. m/0.2 mm/0.33 μm, N2 |
Capillary | OV-1 | 150. | 1414. | Zhang, Chen, et al., 1997 | 25. m/0.2 mm/0.33 μm, N2 |
Capillary | OV-1 | 150. | 1415. | Zhang, Chen, et al., 1997 | 25. m/0.2 mm/0.33 μm, N2 |
Capillary | OV-1 | 160. | 1423. | Zhang, Chen, et al., 1997 | 25. m/0.2 mm/0.33 μm, N2 |
Capillary | OV-101 | 140. | 1409.0 | Gerasimenko, Kirilenko, et al., 1981 | N2; Column length: 50. m; Column diameter: 0.3 mm |
Capillary | OV-101 | 160. | 1422.4 | Gerasimenko, Kirilenko, et al., 1981 | N2; Column length: 50. m; Column diameter: 0.3 mm |
Capillary | OV-1 | 130. | 1410. | Engewald, Wennrich, et al., 1979 | Column length: 50. m; Column diameter: 0.23 mm |
Packed | SE-30 | 150. | 1418. | Shlyakhov, Anvaer, et al., 1975 |

Van Den Dool and Kratz RI, non-polar column, temperature ramp

Column type | Active phase | I | Reference | Comment |
---|---|---|---|---|
Capillary | Petrocol DH | 1396. | White, Hackett, et al., 1992 | 100. m/0.25 mm/0.5 μm, He, 1. K/min; Tstart: 30. C; Tend: 220. C |

Van Den Dool and Kratz RI, non-polar column, custom temperature program

Column type | Active phase | I | Reference | Comment |
---|---|---|---|---|
Capillary | HP-5 | 1418.7 | Sandercock and du Pasquier, 2003 | 30. m/0.25 mm/0.25 μm, He; Program: 40C(3min) => 4C/min => 208C => 25C/min => 290C(5min) |

Van Den Dool and Kratz RI, polar column, temperature ramp

Column type | Active phase | I | Reference | Comment |
---|---|---|---|---|
Capillary | Supelcowax-10 | 2000. | Chung, Yung, et al., 2002 | 60. m/0.25 mm/0.25 μm, He, 35. C @ 5. min, 2. K/min, 195. C @ 90. min |
Capillary | Supelcowax-10 | 2000. | Chung, Yung, et al., 2001 | 60. m/0.25 mm/0.25 μm, He, 35. C @ 5. min, 2. K/min, 195. C @ 90. min |
Capillary | Supelcowax-10 | 2000. | Chung, 1999 | 60. m/0.25 mm/0.25 μm, He, 35. C @ 5. min, 2. K/min, 195. C @ 90. min |

Normal alkane RI, non-polar column, isothermal

Column type | Active phase | Temperature (C) | I | Reference | Comment |
---|---|---|---|---|---|
Capillary | OV-101 | 120. | 1409. | Nabivach and Gerasimenko, 1996 | |
Packed | Polydimethyl siloxane | 147. | 1414. | Ferrand, 1962 |

Normal alkane RI, non-polar column, temperature ramp

Column type | Active phase | I | Reference | Comment |
---|---|---|---|---|
Capillary | Petrocol DH | 1396. | Supelco, 2012 | 100. m/0.25 mm/0.50 μm, Helium, 20. C @ 15. min, 15. K/min, 220. C @ 30. min |
Capillary | Ultra-1 | 1386. | Elizalde-González, Hutfliess, et al., 1996 | 50. m/0.2 mm/0.33 μm, H2, 3. K/min, 300. C @ 35. min; Tstart: 60. C |

Normal alkane RI, non-polar column, custom temperature program

Column type | Active phase | I | Reference | Comment |
---|---|---|---|---|
Capillary | OV-1 | 1409.5 | Dimov, Osman, et al., 1994 | Program: not specified |
Capillary | OV-1, SE-30, Methyl silicone, SP-2100, OV-101, DB-1, etc. | 1410. | Waggott and Davies, 1984 | Hydrogen; Column length: 50. m; Column diameter: 0.32 mm; Program: not specified |

Lee's RI, non-polar column, temperature ramp

Column type | Active phase | I | Reference | Comment |
---|---|---|---|---|
Capillary | DB-5MS | 242.99 | Sun, Zhou, et al., 2008 | 30. m/0.25 mm/0.25 μm, 50. C @ 2. min, 6. K/min, 300. C @ 16. min |
Capillary | 5 % Phenyl methyl siloxane | 240.66 | Skrbic and Onjia, 2006 | 2. K/min; Tstart: 50. C; Tend: 250. C |
Capillary | PTE-5 | 243.20 | Wang, Jia, et al., 2000 | 30. m/0.25 mm/0.25 μm, 60. C @ 1.5 min, 8. K/min, 300. C @ 12.5 min |
Capillary | PTE-5 | 243.75 | Wang, Jia, et al., 2000 | 30. m/0.25 mm/0.25 μm, 60. C @ 1.5 min, 8. K/min, 300. C @ 12.5 min |
Capillary | HP-5 | 243.05 | Piao, Chu, et al., 1999 | 30. m/0.25 mm/0.25 μm, 50. C @ 2. min, 4. K/min, 280. C @ 20. min |
Capillary | DB-5 | 242.19 | Williams and Horne, 1995 | He, 60. C @ 2. min, 5. K/min; Column length: 25. m; Column diameter: 0.3 mm; Tend: 270. C |
Capillary | CP Sil 8 CB | 242.9 | Bundt, Herbel, et al., 1991 | 50. m/0.25 mm/0.25 μm, He, 4. K/min; Tstart: 80. C; Tend: 300. C |
Capillary | SE-52 | 242.77 | Vassilaros, Kong, et al., 1982 | 20. m/0.30 mm/0.25 μm, H2, 40. C @ 2. min, 4. K/min; Tend: 265. C |
Capillary | SE-52 | 240.66 | Lee, Vassilaros, et al., 1979 | 12. m/0.3 mm/0.34 μm, He, 2. K/min; Tstart: 50. C; Tend: 250. C |

Lee's RI, non-polar column, custom temperature program

Column type | Active phase | I | Reference | Comment |
---|---|---|---|---|
Capillary | DB-5MS | 243.8 | Aracil, Font, et al., 2005 | Column length: 60. m; Column diameter: 0.25 mm; Program: not specified |
Capillary | Ultra-1 | 240.7 | Sremac, Skrbic, et al., 2005 | 50. m/0.32 mm/0.50 μm, Nitrogen; Program: 40-100 0C 3-15 0C/min -> 290 0C |
Capillary | HP-5 | 244.29 | Sandercock and du Pasquier, 2003 | 30. m/0.25 mm/0.25 μm, He; Program: 40C(3min) => 4C/min => 208C => 25C/min => 290C(5min) |
Capillary | DB-5 | 242.6 | Paschke, Herbel, et al., 1992 | 30. m/0.25 mm/0.25 μm, He; Program: 60 0C (3 min) 10 0C/min -> 100 0C (3 min) 5 0C/min -> 300 0C |
Capillary | DB-5 | 244.1 | Paschke, Herbel, et al., 1992 | 30. m/0.25 mm/0.25 μm, He; Program: 60 0C (3 min) 10 0C/min -> 100 0C (3 min) 5 0C/min -> 300 0C |
Capillary | CP Sil 8 CB | 242.8 | Bundt, Herbel, et al., 1991 | 50. m/0.25 mm/0.25 μm, He; Program: not specified |
Capillary | CP Sil 8 CB | 242.8 | Bundt, Herbel, et al., 1991 | 50. m/0.25 mm/0.25 μm, He; Program: not specified |

References

Thermodynamics Research Center, 1997
Thermodynamics Research Center,
Selected Values of Properties of Chemical Compounds., Thermodynamics Research Center, Texas A&M University, College Station, Texas, 1997. [all data]
Evans and Smith, 1953
Evans, R.F.; Smith, J.C.,
J. Inst. Pet., 1953, 39, 716. [all data]
Kruber and Oberkobusch, 1951
Kruber, O.; Oberkobusch, R.,
Chem. Ber., 1951, 84, 826. [all data]
Bailey, Bryant, et al., 1947
Bailey; Bryant; Hancock; Morrell; Smith, J.O.,
The ten dimethylnaphthalenes, their physical properties, molecular compounds, and ultra-violet spectra,
J. Inst. Pet., 1947, 33, 503. [all data]
Kruber and Schade, 1936
Kruber, O.; Schade, W.,
Chem. Ber., 1936, 69, 1722. [all data]
Barnett and Sanders, 1933
Barnett, E.B.; Sanders, F.G.,
The synthesis of some homologous naphthalenes,
J. Chem. Soc., 1933, 1933, 434. [all data]
Weast and Grasselli, 1989
CRC Handbook of Data on Organic Compounds, 2nd Editon, Weast,R.C and Grasselli, J.G., ed(s)., CRC Press, Inc., Boca Raton, FL, 1989, 1. [all data]
Kusakov, et al., 1963
Kusakov, M.M., et al.,
Ultraviolet Absorption Spectra of Aromatic Hydrocarbons, 1963, 242. [all data]
Gerasimenko and Nabivach, 1997
Gerasimenko, V.A.; Nabivach, V.M.,
Sorption-structure correlations in the series of alkyl derivatives of naphthalene,
J. Anal. Chem. USSR (Engl. Transl.), 1997, 52, 1, 21-27. [all data]
Zhang, Chen, et al., 1997
Zhang, M.; Chen, B.; Shen, S.; Chen, S.,
Compositional studies of high-temperature coal tar by g.c.-FT-i.r. analysis of middle oil fractions,
Fuel, 1997, 76, 5, 415-423, https://doi.org/10.1016/S0016-2361(97)85518-4
. [all data]
Gerasimenko, Kirilenko, et al., 1981
Gerasimenko, V.A.; Kirilenko, A.V.; Nabivach, V.M.,
Capillary gas chromatography of aromatic compounds found in coal tar fractions,
J. Chromatogr., 1981, 208, 1, 9-16, https://doi.org/10.1016/S0021-9673(00)87953-4
. [all data]
Engewald, Wennrich, et al., 1979
Engewald, W.; Wennrich, L.; Ritter, E.,
Molekülstruktur und Retentionsverhalten. XII. Zur Retention von Alkylnaphthalinen Bei der Gasverteilungs- und Gas-Adsorptions-Chromatographie,
J. Chromatogr., 1979, 174, 2, 315-323, https://doi.org/10.1016/S0021-9673(00)86005-7
. [all data]
Shlyakhov, Anvaer, et al., 1975
Shlyakhov, A.F.; Anvaer, B.I.; Zolotareva, O.V.; Romina, N.N.; Novikova, N.V.; Koreshkova, R.I.,
On the possibility of group indentification of hydrocarbons by gas chromatography from temperature coefficients of retention indices,
Zh. Anal. Khim., 1975, 30, 788-792. [all data]
White, Hackett, et al., 1992
White, C.M.; Hackett, J.; Anderson, R.R.; Kail, S.; Spock, P.S.,
Linear temperature programmed retention indices of gasoline range hydrocarbons and chlorinated hydrocarbons on cross-linked polydimethylsiloxane,
J. Hi. Res. Chromatogr., 1992, 15, 2, 105-120, https://doi.org/10.1002/jhrc.1240150211
. [all data]
Sandercock and du Pasquier, 2003
Sandercock, P.M.L.; du Pasquier, E.,
Chemical fingerprinting of unevaporated automotive gasoline samples,
Forensic Sci. Int., 2003, 134, 1, 1-10, https://doi.org/10.1016/S0379-0738(03)00081-1
. [all data]
Chung, Yung, et al., 2002
Chung, H.-Y.; Yung, I.K.S.; Ma, W.C.J.; Kim, J.-S.,
Analysis of volatile components in frozen and dried scallops (Patinopecten yessoensis) by gas chromatography/mass spectrometry,
Food Res. Int., 2002, 35, 1, 43-53, https://doi.org/10.1016/S0963-9969(01)00107-7
. [all data]
Chung, Yung, et al., 2001
Chung, H.Y.; Yung, I.K.S.; Kim, J.-S.,
Comparison of volatile components in dried scallops (Chlamys farreri and Patinopecten yessoensis) prepared by boiling and steaming methods,
J. Agric. Food Chem., 2001, 49, 1, 192-202, https://doi.org/10.1021/jf000692a
. [all data]
Chung, 1999
Chung, H.Y.,
Volatile components in crabmeats of Charybdis feriatus,
J. Agric. Food Chem., 1999, 47, 6, 2280-2287, https://doi.org/10.1021/jf981027t
. [all data]
Nabivach and Gerasimenko, 1996
Nabivach, V.M.; Gerasimenko, V.A.,
Gas chromatographic retention characteristics of bicyclic aromatic hydrocarbons,
Coke and Chemistry (Rus), 1996, 6, 27-31. [all data]
Ferrand, 1962
Ferrand, R.,
Gas phase chromatography using retention indices for the analysis of tars and their hydrogenation products,
Journees internationales d'etude des methodes de separation immediate at de chromatographie; Org. sur l'initiative du IX., 1962, 132-140. [all data]
Supelco, 2012
Supelco, CatalogNo. 24160-U,
Petrocol DH Columns. Catalog No. 24160-U, 2012, retrieved from http://www.sigmaaldrich.com/etc/medialib/docs/Supelco/Datasheet/1/w97949.Par.0001.File.tmp/w97949.pdf. [all data]
Elizalde-González, Hutfliess, et al., 1996
Elizalde-González, M.P.; Hutfliess, M.; Hedden, K.,
Retention index system, adsorption characteristics, and sructure correlations of polycyclic aromatic hydrocarbons in fuels,
J. Hi. Res. Chromatogr., 1996, 19, 6, 345-352, https://doi.org/10.1002/jhrc.1240190608
. [all data]
Dimov, Osman, et al., 1994
Dimov, N.; Osman, A.; Mekenyan, Ov.; Papazova, D.,
Selection of moelcular descriptors used in quantitative structure-gas chromatographic retention relationships. I. Application to alkylbenzenes and naphthalenes,
Anal. Chim. Acta., 1994, 298, 3, 303-317, https://doi.org/10.1016/0003-2670(94)00280-0
. [all data]
Waggott and Davies, 1984
Waggott, A.; Davies, I.W.,
Identification of organic pollutants using linear temperature programmed retention indices (LTPRIs) - Part II, 1984, retrieved from http://dwi.defra.gov.uk/research/completed-research/reports/dwi0383.pdf. [all data]
Sun, Zhou, et al., 2008
Sun, P.; Zhou, Q.; Li, G.; Wang, X.; Zhao, Y.; Cao, L.,
fingerprint analysis of polycyclic aromatic hydrocarbons in crude oil by internal standard method,
J. Instrumental Anal., 2008, 27, 4, 344-348. [all data]
Skrbic and Onjia, 2006
Skrbic, B.; Onjia, A.,
Prediction of Lee Retention Indices of Polycyclic Aromatic Hydrocarbons by Artificial Neural Networks,
J. Chromatorg. A, 2006, 1108, 2, 279-284, https://doi.org/10.1016/j.chroma.2006.01.080
. [all data]
Wang, Jia, et al., 2000
Wang, J.; Jia, C.R.; Wong, C.K.; Wong, P.K.,
Characterization of polycyclic aromatic hydrocarbons created in lubricating oils,
Water Air Soil Poll., 2000, 120, 3/4, 381-396, https://doi.org/10.1023/A:1005251618062
. [all data]
Piao, Chu, et al., 1999
Piao, M.; Chu, S.; Zheng, M.; Xu, X.,
Characterization of the combustion products of polyethylene,
Chemosphere, 1999, 39, 9, 1497-1512, https://doi.org/10.1016/S0045-6535(99)00054-5
. [all data]
Williams and Horne, 1995
Williams, P.T.; Horne, P.A.,
Analysis of aromatic hydrocarbons in pyrolytic oil derived from biomass,
J. Anal. Appl. Pyrolysis, 1995, 31, 15-37, https://doi.org/10.1016/0165-2370(94)00814-H
. [all data]
Bundt, Herbel, et al., 1991
Bundt, J.; Herbel, W.; Steinhart, H.; Franke, S.; Francke, W.,
Structure-type separation of diesel fuels by solid phase extraction and identification of the two- and three-ring aromatics by capillary GC-mass spectrometry,
J. Hi. Res. Chromatogr., 1991, 14, 2, 91-98, https://doi.org/10.1002/jhrc.1240140205
. [all data]
Vassilaros, Kong, et al., 1982
Vassilaros, D.L.; Kong, R.C.; Later, D.W.; Lee, M.L.,
Linear retention index system for polycyclic aromatic compounds. Critical evaluation and additional indices,
J. Chromatogr., 1982, 252, 1-20, https://doi.org/10.1016/S0021-9673(01)88394-1
. [all data]
Lee, Vassilaros, et al., 1979
Lee, M.L.; Vassilaros, D.L.; White, C.M.; Novotny, M.,
Retention Indices for Programmed-Temperature Capillary-Column Gas Chromatography of Polycyclic Aromatic Hydrocarbons,
Anal. Chem., 1979, 51, 6, 768-773, https://doi.org/10.1021/ac50042a043
. [all data]
Aracil, Font, et al., 2005
Aracil, I.; Font, R.; Conesa, J.A.,
Semivolatile and volatile compounds from the pyrolysis and combustion of polyvinyl chloride,
J. Anal. Appl. Pyrolysis, 2005, 74, 1-2, 465-478, https://doi.org/10.1016/j.jaap.2004.09.008
. [all data]
Sremac, Skrbic, et al., 2005
Sremac, S.; Skrbic, B.; Onjia, A.,
Artificial neural network prediction of quantitative structure-retention relationships of polycyclic aromatic hydrocarbons in gas chromatography,
J. Serb. Chem. Soc., 2005, 70, 11, 1291-1300, https://doi.org/10.2298/JSC0511291S
. [all data]
Paschke, Herbel, et al., 1992
Paschke, A.; Herbel, W.; Steinhart, H.; Franke, S.; Francke, W.,
Determination of mono- to tetracyclic aromatic hydrocarbons in lubricating oil,
J. Hi. Res. Chromatogr., 1992, 15, 12, 827-833, https://doi.org/10.1002/jhrc.1240151211
. [all data]