Acetamide, N-1-naphthalenyl-

Phase change data

Data compiled by: William E. Acree, Jr., James S. Chickos

Enthalpy of sublimation

ΔsubH (kJ/mol) Temperature (K) Method Reference Comment
94.1348.5AStephenson and Malanowski, 1987Based on data from 337. - 360. K. See also Aihara, 1960.

References

Stephenson and Malanowski, 1987
Stephenson, Richard M.; Malanowski, Stanislaw, Handbook of the Thermodynamics of Organic Compounds, 1987, https://doi.org/10.1007/978-94-009-3173-2 . [all data]

Aihara, 1960
Aihara, Ariyuki, Estimation of the Energy of Hydrogen Bonds Formed in Crystals. III. Amides, Bull. Chem. Soc. Jpn., 1960, 33, 9, 1188-1194, https://doi.org/10.1246/bcsj.33.1188 . [all data]