Meprobamate

Normal alkane RI, non-polar column, custom temperature program

Data compiled by: NIST Mass Spectrometry Data Center, William E. Wallace, director

Column type CapillaryCapillaryOther
Active phase 5 % Phenyl methyl siloxane5 % Phenyl methyl siloxaneMethyl Silicone
Column length (m) 25.25.
Carrier gas
Substrate
Column diameter (mm) 0.200.20
Phase thickness (μm) 0.330.33
Program 50 0C (0.5 min) 99 0C/min -> 100 0C (1 min) 15 0C/min -> 280 0C (20 min)50 0C (0.5 min) 99 0C/min -> 100 0C (1 min) 15 0C/min -> 280 0C (20 min)not specified
I 1826.1832.1796.
ReferenceGrigoriev and Savchuk, 2010Grigoriev and Savchuk, 2010Ardrey and Moffat, 1981
Comment MSDC-RI MSDC-RI MSDC-RI

References

Grigoriev and Savchuk, 2010
Grigoriev, A.M.; Savchuk, S.A., Correlation of the parameters of screening libraries of the gas-chromatographic retention data, Rus. J. Anal. Chem. (Engl. Transl.), 2010, 65, 4, 388-397. [all data]

Ardrey and Moffat, 1981
Ardrey, R.E.; Moffat, A.C., Gas-liquid chromatographic retention indices of 1318 substances of toxicological interest on SE-30 or OV-1 stationary phase, J. Chromatogr., 1981, 220, 3, 195-252, https://doi.org/10.1016/S0021-9673(00)81925-1 . [all data]