4H-1-Benzopyran-4-one, 2-methyl-

Normal alkane RI, non-polar column, temperature ramp

View large format table.

Column type Active phase I Reference Comment
CapillaryDB-11318.Flath, Matsumoto, et al., 198960. m/0.32 mm/0.25 μm, 4. K/min; Tstart: 50. C; Tend: 250. C

References

Flath, Matsumoto, et al., 1989
Flath, R.A.; Matsumoto, K.E.; Binder, R.G.; Cunningham, R.T.; Mon, T.R., Effect of pH on the volatiles of hydrolyzed protein insect baits, J. Agric. Food Chem., 1989, 37, 3, 814-819, https://doi.org/10.1021/jf00087a053 . [all data]