Furan, 2-[(methyldithio)methyl]-

Van Den Dool and Kratz RI, non-polar column, custom temperature program

Data compiled by: NIST Mass Spectrometry Data Center, William E. Wallace, director

Column type CapillaryCapillaryCapillary
Active phase CP-Sil 8CB-MSBPX-5BPX-5
Column length (m) 60.50.50.
Carrier gas HeHeHe
Substrate
Column diameter (mm) 0.250.320.32
Phase thickness (μm) 0.250.50.5
Program 0C(5min) => 40C/min => 40C (2min) => 4C/min => 280C0C(5min) => 40C/min => 40C(2min) => 4C/min => 280COC (5min) => 60C/min => 60C(5min) => 4C/min => 250C
I 1226.1226.1237.
ReferenceElmore, Mottram, et al., 2000Elmore, Mottram, et al., 1999Bredie, Mottram, et al., 1998
Comment MSDC-RI MSDC-RI MSDC-RI

Normal alkane RI, polar column, temperature ramp

Data compiled by: NIST Mass Spectrometry Data Center, William E. Wallace, director

Column type CapillaryCapillaryCapillaryCapillary
Active phase TC-WaxDB-WaxDB-WaxCarbowax 20M
Column length (m) 60.60.30.50.
Carrier gas HeHeHeHe
Substrate
Column diameter (mm) 0.250.250.250.25
Phase thickness (μm) 0.50.250.25
Tstart (C) 40.40.40.70.
Tend (C) 230.210.210.180.
Heat rate (K/min) 3.3.3.2.
Initial hold (min) 8.
Final hold (min)
I 1818.1813.1806.1770.
ReferenceIshikawa, Ito, et al., 2004Kumazawa and Masuda, 2003Kumazawa and Masuda, 2003Tressl and Silwar, 1981
Comment MSDC-RI MSDC-RI MSDC-RI MSDC-RI

References

Elmore, Mottram, et al., 2000
Elmore, J.S.; Mottram, D.S.; Enser, M.; Wood, J.D., The effects of diet and breed on the volatile compounds of cooked lamb, Meat Sci., 2000, 55, 2, 149-159, https://doi.org/10.1016/S0309-1740(99)00137-0 . [all data]

Elmore, Mottram, et al., 1999
Elmore, J.S.; Mottram, D.S.; Enser, M.; Wood, J.D., Effect of the polyunsaturated fatty acid composition of beef muscle on the profile of aroma volatiles, J. Agric. Food Chem., 1999, 47, 4, 1619-1625, https://doi.org/10.1021/jf980718m . [all data]

Bredie, Mottram, et al., 1998
Bredie, W.L.P.; Mottram, D.S.; Guy, R.C.E., Aroma volatiles generated during extrusion cooking of maize flour, J. Agric. Food Chem., 1998, 46, 4, 1479-1487, https://doi.org/10.1021/jf9708857 . [all data]