Phthalocyanine

Phase change data

Data compiled by: William E. Acree, Jr., James S. Chickos

Enthalpy of sublimation

ΔsubH (kJ/mol) Temperature (K) Method Reference
223.8 ± 1.3598. - 698.MESEMYANNIKOV, BASOVA, et al., 2000

References

SEMYANNIKOV, BASOVA, et al., 2000
SEMYANNIKOV, P.P.; BASOVA, T.V.; GRANKIN, V.M.; IGUMENOV, I.K., Vapour pressure of some phthalocyanines, J. Porphyrins Phthalocyanines, 2000, 04, 03, 271-277, https://doi.org/10.1002/(SICI)1099-1409(200004/05)4:3<271::AID-JPP205>3.0.CO;2-4 . [all data]