Fructose

Condensed phase thermochemistry data

Data compiled by: Hussein Y. Afeefy, Joel F. Liebman, and Stephen E. Stein

Quantity Value Units Method Reference Comment
Δfsolid-302.49 ± 0.11kcal/molCcbClarke and Stegeman, 1939Reanalyzed by Cox and Pilcher, 1970, Original value = -302.38 kcal/mol
Quantity Value Units Method Reference Comment
Δcsolid-671.70 ± 0.08kcal/molCcbClarke and Stegeman, 1939Corresponding Δfsolid = -302.50 kcal/mol (simple calculation by NIST; no Washburn corrections)

Reaction thermochemistry data

Data compiled by: Hussein Y. Afeefy, Joel F. Liebman, and Stephen E. Stein

Individual Reactions

Sucrose + Water = α-D-Glucopyranose + Fructose

By formula: C12H22O11 + H2O = C6H12O6 + C6H12O6

Quantity Value Units Method Reference Comment
Δr-3.568 ± 0.038kcal/molEqkGoldberg, Tewari, et al., 1989liquid phase; solvent: Aqueous

References

Clarke and Stegeman, 1939
Clarke, T.H.; Stegeman, G., Heats of combustion of some mono- and disaccharides, J. Am. Chem. Soc., 1939, 61, 1726-1730. [all data]

Cox and Pilcher, 1970
Cox, J.D.; Pilcher, G., Thermochemistry of Organic and Organometallic Compounds, Academic Press, New York, 1970, 1-636. [all data]

Goldberg, Tewari, et al., 1989
Goldberg, R.N.; Tewari, Y.B.; Ahluwalia, J.C., Thermodynamics of the hydrolysis of sucrose, J. Biol. Chem., 1989, 264, 9901-99. [all data]